{"text_format":"1","workbook":"xlsx","n_sheets":15,"sheets":["Introductie","1. Algemeen","2. Landbouw","3. KRW","4. Terrestrisch","5. Overig","6. Dashboard Risico's","Risicolegger landbouw","Risicolegger KRW","Risicolegger Terrestrisch","Risicolegger Overig","Grenswaarden KRW","Invoer","Grenswaarden landbouw","Grenswaarden Terrestrisch"],"not_rendered":{"charts":1,"images":1,"macros":1,"external_links":0,"defined_names":51,"comments":0,"pivot_tables":0},"unopened":[],"bounds":{"document_bytes":16777216,"sheet_cells":100000,"rows_first":2000,"rows_last":500,"rows_between":2000,"halvings":0,"cell_chars":16384,"cell_head_chars":4096},"cells_cut":0,"cells_raw":0,"read":"whole","date_system":"1900"}

{"sheet":"Introductie","index":0,"n_rows":42,"n_cols":7,"rows_kept":42,"cut":false,"hidden":false,"merged":[[33,6,36,6]]}
[]
[null,null,"AFWEGINGSKADER - HOE OM TE GAAN MET ZOET-ZOUT DYNAMIEK?"]
[]
[]
[null,null,"Woord vooraf"]
[null,null,"Deze excel bundelt veel verschillende kennis om risico's aangaande de zoet-zout dynamiek te bepalen. De meeste vragen en risicobepalingen zijn voorzien van bijschriften, die meer informatie geven over wat met de vraag wordt bedoeld of hoe u de risico's kunt interpreteren. Let op! Lees de bijschriften goed door."]
[]
[null,null,"Advies: gebruik deze excel op een groot scherm."]
[]
[]
{"$rows_left_out":33}
{"sheet":"1. Algemeen","index":1,"n_rows":106,"n_cols":27,"rows_kept":106,"cut":false,"hidden":false,"merged":[[62,4,62,7],[75,2,78,10],[65,2,65,10]]}
[]
[]
[null,null,"Afbakening projectgebied voor afwegingskader"]
[]
[null,null,"Wat is het schaalniveau* waarvoor u het afwegingskader gebruikt (zelf invullen, geen keuzemenu)?",null,null,null,null,null,null,null,null,null,null,null,"Legenda"]
[null,null,"  Bijv.: individuele polder, boezemsysteem, geheel beheergebied"]
[null,null,null,null,null,null,null,null,null,null,null,null,null,null,null,null,"Een invulveld waar nog geen waarde is ingevuld*"]
[null,null,"*De rest van de vragen in dit afwegingskader gaan over dit projectgebied",null,null,null,null,null,null,null,null,null,null,null,null,null,"Een invulveld waar een correcte waarde is ingevuld"]
[null,null,null,null,null,null,null,null,null,null,null,null,null,null,null,null,"Een klik-keuze menu**"]
[null,null,null,null,null,null,null,null,null,null,null,null,null,null,null,null,"Een veld dat, afhankelijk van de invoer van andere vragen, een invulveld wordt of instructies geeft"]
{"$rows_left_out":97}
{"sheet":"2. Landbouw","index":2,"n_rows":88,"n_cols":27,"rows_kept":88,"cut":false,"hidden":false,"merged":[[25,14,26,24]]}
[]
[]
[null,null,"Agrarisch grondgebruik",null,null,null,null,null,null,null,null,null,null,null,null,"Legenda"]
[]
[null,null,"  In dit blok wordt gevraagd welke doelgewassen worden gebruikt. Voor een eenvoudig overzicht kiest u hier voor 1 doelgewas. U kunt ook meerdere"]
[null,null,"  doelgewassen tegelijkertijd selecteren.",null,null,null,null,null,null,null,null,null,null,null,null,null,null,"Een invulveld waar nog geen waarde is ingevuld*"]
[null,null,null,null,null,null,null,null,null,null,null,null,null,null,null,null,null,"Een invulveld waar een correcte waarde is ingevuld"]
[null,null,"Welk van onderstaande doelgewassen worden er geteeld?",null,null,null,null,null,null,null,null,null,null,null,null,null,null,"Een klik-keuze menu**"]
[null,null,"  Ga hierbij uit van een periode van 5 jaar in het geval van wisselteelt.",null,null,null,null,null,null,null,null,null,null,null,null,null,null,"Een veld dat, afhankelijk van de invoer van andere vragen, een invulveld wordt of instructies geeft"]
[null,null,"Gras",null,null,false]
{"$rows_left_out":79}
{"sheet":"3. KRW","index":3,"n_rows":96,"n_cols":30,"rows_kept":96,"cut":false,"hidden":false,"merged":[[8,2,8,7],[57,2,57,8],[93,2,93,8]]}
[]
[]
[]
[null,null,"KRW-doeltypen"]
[]
[null,null,"In dit blok kunt u aangeven welk(e) KRW doel(en) u nastreeft in uw projectgebied en/of welke habitattypen er voorkomen. Vul alleen blauwe velden in. Witte velden worden niet meegenomen."]
[null,null,"Kwaliteitselement vis wordt niet meegenomen in dit afwegingskader."]
[null,null,"Welke KRW-doeltypen komen in het projectgebied voor?",null,null,null,null,null,null,"Welk KRW-doeltype streeft u na?",null,"Wat is de EKR-score?"]
[null,null,"Verander de 0 in een 1 als het type in uw gebied voorkomt. \nHet afwegingskader staat toe om maximaal 5 KRW-doeltypen en 2 N2000 habitattypen tegelijk te toetsen.",null,null,null,null,null,null,"Geef per geselecteerd KRW-doeltype aan welk KRW-doeltype u voor ditzelfde water nastreeft. Dit kan hetzelfde of anders zijn.",null,"Geef per geselecteerd KRW-doeltype aan wat de EKR-score is."]
[]
{"$rows_left_out":87}
{"sheet":"4. Terrestrisch","index":4,"n_rows":75,"n_cols":28,"rows_kept":75,"cut":false,"hidden":false,"merged":[[37,2,38,4],[74,3,74,4],[69,3,69,4],[70,3,70,4],[71,3,71,4],[72,3,72,4],[73,3,73,4],[65,2,66,8]]}
[]
[]
[]
[null,null,"NNN beheertypen",null,null,null,null,null,"N2000 habitattypen",null,null,null,null,null,null,null,"Legenda"]
[]
[null,null,"In dit blok kunt u aangeven welke NNN beheertypen in uw gebied voorkomen.",null,null,null,null,null,"In dit blok kunt u aangeven welke habitattypen in uw gebied voorkomen en wat de huidige staat van kwaliteit hiervan is."]
[]
[null,null,"Welke NNN beheertypen komen in het projectgebied voor?",null,null,null,null,null,"Welke N2000 habitattypen komen in het projectgebied voor?",null,null,null,"Wat is de huidige staat van kwaliteit van de geselecteerde habitattypen?",null,null,null,null,null,"Een invulveld waar nog geen waarde is ingevuld"]
[null,null,"Verander de 0 in een 1 als het type in uw gebied voorkomt.",null,null,null,null,null,"Verander de 0 in een 1 als het type in uw gebied voorkomt.",null,null,null,"Maak gebruik van de drop-down lijst om een keuze te maken. ",null,null,null,null,null,"Een invulveld waar een correcte waarde is ingevuld"]
[null,null,{"$f":"Invoer!B61","v":"N01.03-Rivier- en moeraslandschap"},null,0,null,null,null,"H1320 - Slijkgrasvelden",null,0]
{"$rows_left_out":66}
{"sheet":"5. Overig","index":5,"n_rows":16,"n_cols":5,"rows_kept":16,"cut":false,"hidden":false,"merged":[[4,12,4,15]]}
[]
[]
[null,null,"Overig"]
[]
[null,null,"Zijn er nog andere facetten die mogelijk last kunnen hebben van de verstoring of fysieke ingreep?"]
[]
[]
[]
[]
[]
{"$rows_left_out":7}
{"sheet":"6. Dashboard Risico's","index":6,"n_rows":280,"n_cols":23,"rows_kept":280,"cut":false,"hidden":false,"merged":[[74,3,74,9],[75,3,75,9],[154,3,154,7],[155,3,155,7],[146,3,146,7],[147,3,147,7],[148,3,148,7],[149,3,149,7],[150,3,150,7],[125,3,125,7],[126,3,126,7],[124,3,124,7],[136,3,136,11],[138,3,138,11],[139,3,139,11],[140,3,140,11],[131,3,131,11],[132,3,132,11],[133,3,133,11],[134,3,134,11],[135,3,135,11],[69,3,69,7],[70,3,70,7],[80,3,80,7],[107,3,107,7],[117,3,117,7],[8,2,8,11],[151,3,151,7],[153,3,153,7],[119,3,119,7],[120,3,120,7],[121,3,121,7],[122,3,122,7],[93,3,93,7],[94,3,94,7],[95,3,95,7],[96,3,96,7],[97,3,97,7],[118,3,118,7],[98,3,98,7],[99,3,99,7],[100,3,100,7],[101,3,101,7],[102,3,102,7],[103,3,103,7],[259,3,259,7],[260,3,260,7],[170,3,170,11],[172,3,172,11],[173,3,173,11],[174,3,174,11],[171,3,171,11],[247,3,247,7],[248,3,248,7],[249,3,249,7],[250,3,250,7],[230,3,230,7],[231,3,231,7],[233,3,233,7],[234,3,234,7],[235,3,235,7],[226,3,226,7],[227,3,227,7],[228,3,228,7],[229,3,229,7],[261,3,261,7],[262,3,262,7],[263,3,263,7],[252,3,252,7],[254,3,254,7],[255,3,255,7],[256,3,256,7],[258,3,258,7],[165,3,165,11],[166,3,166,11],[167,3,167,11],[168,3,168,11],[169,3,169,11],[191,3,191,11],[177,3,177,11],[178,3,178,11],[179,3,179,11],[251,3,251,7],[242,3,242,7],[237,3,237,7],[238,3,238,7],[239,3,239,7],[240,3,240,7],[241,3,241,7],[174,18,174,22],[175,18,175,22],[176,18,176,22],[190,3,190,11],[187,3,187,11],[188,3,188,11],[189,3,189,11],[165,18,165,22],[166,18,166,22],[167,18,167,22],[168,18,168,22],[169,18,169,22],[170,18,170,22],[171,18,171,22],[172,18,172,22],[173,18,173,22],[185,3,185,11],[180,3,180,11],[181,3,181,11],[182,3,182,11],[183,3,183,11],[184,3,184,11],[175,3,175,11],[176,3,176,11],[56,0,281,0],[56,15,281,15],[193,18,193,22],[194,18,194,22],[195,18,195,22],[188,18,188,22],[189,18,189,22],[190,18,190,22],[191,18,191,22],[192,18,192,22],[182,18,182,22],[183,18,183,22],[184,18,184,22],[185,18,185,22],[187,18,187,22],[177,18,177,22],[178,18,178,22],[179,18,179,22],[180,18,180,22],[181,18,181,22],[192,3,192,11],[193,3,193,11],[194,3,194,11],[195,3,195,11]]}
[null,null,null,null,null,null,null,null,null,null,null,null,null,null,1]
[null,null,"DASHBOARD",null,null,null,null,null,null,null,null,null,null,null,1]
[null,null,null,null,null,null,null,null,null,null,null,null,null,null,1]
[null,null,"In dit dashboard wordt een samenvatting gepresenteerd van de verwachte risco's voor de functies die zijn gekozen op tabblad 1. Algemeen.",null,null,null,null,null,null,null,null,null,null,null,1]
[null,null,"Eerst volgt een overzicht van de algemene gegevens, gevolgd door de risico's in de huidige situatie (linkerblok) en de toekomstige situatie (rechterblok), wanneer",null,null,null,null,null,null,null,null,null,null,null,1]
[null,null,"u toetst op een verstoring (verzilting of verzoeting) of op de gevolgen van een fysieke ingreep (bijv.: het plaatsen van damwanden om brakke kwel te verminderen).",null,null,null,null,null,null,null,null,null,null,null,1]
[null,null,"U kunt dit overzicht gebruiken als onderbouwing voor het maken van een gebruikersoordeel hoe te handelen met zoet-zout dynamiek in uw projectgebied.",null,null,null,null,null,null,null,null,null,null,null,1]
[null,null,null,null,null,null,null,null,null,null,null,null,null,null,1]
[null,null,"Het afwegingskader berust op de laatste kennis omtrent de hydrologische, biogeochemische en biologische processen die een effect uitoefenen op de aquatische natuur, terrestrische natuur en landbouw. Op basis van deze kennis is getracht te komen tot grenswaarden (m.b.v. deskundigenoordelen van The Salt Doctors, Van Geest Ecologie en Witteveen+Bos). Een belangrijke kanttekening is dat deze grenswaarden maar zo gedetailleerd kunnen zijn als de huidige kennis toe staat. Hierbij is ervoor gekozen om aan de voorzichtige kant te zitten en risico's sneller als hoger in te schatten."]
[]
{"$rows_left_out":271}
{"sheet":"Risicolegger landbouw","index":7,"n_rows":198,"n_cols":20,"rows_kept":198,"cut":false,"hidden":false,"merged":[[1,0,6,0],[8,0,18,0],[194,0,198,0],[197,2,197,3],[37,2,38,2],[30,0,68,0],[70,0,133,0],[135,0,192,0]]}
[]
["BLOK 1: \nIRRIGATIEWATER"]
[null,null,"Oordeelsblok 1. watervolume irrigatiewater",null,null,null,null,null,null,null,null,null,null,null,{"$f":"IF(O2<>\"\",_xlfn.XLOOKUP('Risicolegger landbouw'!O2,'Grenswaarden landbouw'!$B$22:$B$32,'Grenswaarden landbouw'!$C$22:$C$32),\"\")","v":""},{"$f":"IF(P2<>\"\",_xlfn.XLOOKUP('Risicolegger landbouw'!P2,'Grenswaarden landbouw'!$B$22:$B$32,'Grenswaarden landbouw'!$C$22:$C$32),\"\")","v":""}]
[]
[null,null,{"$f":"_xlfn.CONCAT(\"Irrigatievolume: \", volume_irrigatie,\" mm/jaar\")","v":"Irrigatievolume: 0 mm/jaar"},{"$f":"IF(bool_irrigatie=\"Nee\",\"geen irrigatie toegepast\",IF(volume_irrigatie<>0,IF(volume_irrigatie<=80,\"laag\",IF(volume_irrigatie>200,\"hoog\",\"midden\")),\"niet opgegeven\"))","v":"niet opgegeven"}]
[null,null,"\nToelichting: een te groot irrigatievolume kan leiden tot een te grote opbouw van natrium in de bodem. Dit is met name bij grote volumes gietwater slecht voor de bodemtextuur."]
[]
[]
["BLOK 2: BODEMSTRUCTUUR",null,null,null,null,null,null,null,null,null,null,null,null,null,{"$f":"IF(O2<>\"\",_xlfn.XLOOKUP(1,('Grenswaarden landbouw'!$B$4:$B$18='1. Algemeen'!$K$18)*('Grenswaarden landbouw'!$C$4:$C$18='Risicolegger landbouw'!O3),'Grenswaarden landbouw'!$E$4:$E$18),\"\")","v":""},{"$f":"IF(P2<>\"\",_xlfn.XLOOKUP(1,('Grenswaarden landbouw'!$B$4:$B$18='1. Algemeen'!$K$18)*('Grenswaarden landbouw'!$C$4:$C$18='Risicolegger landbouw'!P3),'Grenswaarden landbouw'!$E$4:$E$18),\"\")","v":""}]
[null,null,"Oordeelsblok 2. bodemstructuur"]
{"$rows_left_out":189}
{"sheet":"Risicolegger KRW","index":8,"n_rows":67,"n_cols":39,"rows_kept":67,"cut":false,"hidden":false,"merged":[[8,10,8,14],[32,10,32,14],[79,10,79,14],[55,10,55,14],[22,0,43,0],[1,0,20,0],[45,0,67,0],[31,22,31,26],[31,28,31,32],[31,34,31,38],[54,22,54,26],[54,28,54,32],[54,34,54,38]]}
[]
["ABIOTISCHE GEVOELIGHEID\n- HUIDIGE SITUATIE -"]
[null,null,"Oordeelsblok 1: abiotische gevoeligheid zoutgehalte huidige situatie",null,null,null,null,null,null,null,null,"N.B.: De verstoring wordt pas beoordeeld in BLOK 3."]
[]
[null,null,"In dit eerste blok ziet u de risicobepaling voor de ingevoerde KRW doelen en habitattypen in de huidige situatie op ABIOTIEK."]
[null,null,"Om uitvoer te zien, dient u te hebben aangegeven welk(e) KRW doel(en) en/of habitattype(n) u wilt doorlichten, wat de huidige staat van kwaliteit is, wat de eigenschappen zijn van de waterbodem en wat de zoutsituatie is."]
[]
[null,null,"Samenvatting eigenschappen KRW-doeltypen"]
[null,null,"Het risico wordt bepaald door het bodemtype, de aanwezigheid van een organische sliblaag en de ontstaansgeschiedenis. Voor bodemtype, zie tabblad 3. KRW - waterbodem.",null,null,null,null,null,null,null,"Risico's"]
[null,null,"KRW-doeltypen",null,"Bodemtype",null,"Organische sliblaag",null,"Ontstaansgeschiedenis",null,"Interne eutrofiëring",null,"Sulfidetoxiciteit",null,"Ammoniumtoxiciteit"]
{"$rows_left_out":58}
{"sheet":"Risicolegger Terrestrisch","index":9,"n_rows":162,"n_cols":20,"rows_kept":162,"cut":false,"hidden":false,"merged":[[140,0,159,0],[85,0,103,0],[36,0,83,0],[1,0,34,0],[51,2,51,4],[39,2,39,4],[90,2,90,4],[88,2,88,4],[89,2,89,4],[105,0,138,0]]}
[null,null,null,null,null,null,null,null,null,null,null,null,null,null,null,null,null,null,1]
["BLOK 1: BIOTISCHE GEVOELIGHEID\n- HUIDIGE SITUATIE -",null,null,null,null,null,null,null,null,null,null,null,null,null,null,null,null,null,1]
[null,null,"Oordeelsblok 1: biotische gevoeligheid zoutgehalte huidige situatie",null,null,null,null,null,null,null,"N.B.: De verstoring wordt pas beoordeeld in BLOK 3.",null,null,null,null,null,null,null,1]
[null,null,null,null,null,null,null,null,null,null,null,null,null,null,null,null,null,null,1]
[null,null,"In dit eerste blok ziet u de risicobepaling voor de ingevoerde habitattypen en beheertypen in de huidige situatie.",null,null,null,null,null,null,null,null,null,null,null,null,null,null,null,1]
[null,null,"Om uitvoer te zien, dient u te hebben aangegeven welk(e) habitat-/beheertype(n) u wilt doorlichten, wat de huidige staat van kwaliteit is en met welke zouteenheid (EC of chloride) u rekent.",null,null,null,null,null,null,null,null,null,null,null,null,null,null,null,1]
[null,null,"Voor het maken van de risicobepaling, wordt het zoutgehalte van het oppervlaktewater vergeleken met de grenswaarden voor verzilting en verzoeting van de ingevoerde habitattypen en beheertypen. ",null,null,null,null,null,null,null,null,null,null,null,null,null,null,null,1]
[null,null,null,null,null,null,null,null,null,null,null,null,null,null,null,null,null,null,1]
[null,null,{"$f":"IF(eenheid_zoutgehalte_algemeen<>\"\",_xlfn.CONCAT(\"De eenheid van het zoutgehalte die door u is opgegeven, is: \"),\n\"De eenheid van het zoutgehalte is nog niet opgegeven. Het is nog niet mogelijk risico's in te schatten.\")","v":"De eenheid van het zoutgehalte is nog niet opgegeven. Het is nog niet mogelijk risico's in te schatten."},null,{"$f":"IF(eenheid_zoutgehalte_algemeen=\"\",\"onbekend\", eenheid_zoutgehalte_algemeen)","v":"onbekend"},null,"Maximaal zoutgehalte:",null,{"$f":"IF(R9=1,165*maximaal_zout_huidig^1.3438,maximaal_zout_huidig)","v":0},"mg Cl/l",null,null,null,null,null,null,null,{"$f":"IF(E9=\"EC-waarde\",1,IF(E9=\"Chloridegehalte\",2,0))","v":0},1]
[null,null,{"$f":"IF(R9=1,\"De ingevulde EC waardes worden voor de functie terrestrische natuur omgerekend naar chloridegehaltes.\",\"\")","v":""},null,null,null,"Minimaal zoutgehalte:",null,{"$f":"IF(R9=1,165*minimaal_zout_huidig^1.3438,minimaal_zout_huidig)","v":0},"mg Cl/l",null,null,null,null,null,null,null,null,1]
{"$rows_left_out":153}
{"sheet":"Risicolegger Overig","index":10,"n_rows":6,"n_cols":3,"rows_kept":6,"cut":false,"hidden":false,"merged":[[5,2,5,11]]}
[]
[]
[null,null,"Oordeelsblok 1: Overig"]
[]
[null,null,"Neem de volgende zaken mee in de eindafweging hoe om te gaan met zoet-zout dynamiek"]
[null,null,{"$f":"IF(overig<>\"\",overig,\"Er zijn geen overige zaken opgegeven waar aanvullend rekening mee gehouden dient te worden.\")","v":"Er zijn geen overige zaken opgegeven waar aanvullend rekening mee gehouden dient te worden."}]

{"sheet":"Grenswaarden KRW","index":11,"n_rows":27,"n_cols":11,"rows_kept":27,"cut":false,"hidden":true,"merged":[]}
[]
[null,null,"Voorjaar","Zomer","Winter",null,"Kwetsbare levensfase","Sterfte soorten","Oplading waterbodem","Afname waterplanten","Voedselweb/Daphnia"]
[null,"zoet (<300 mg Cl/l)","Zeer sterk",null,null,"Mogelijk sterfte sommige soorten van zoete milieus, kwetsbare levensfase, oplading van waterbodem met zout","Ja","Ja","Ja","Nee","Nee"]
[null,"zoet (<300 mg Cl/l)",null,"Sterk",null,"Mogelijk sterfte sommige soorten van zoete milieus","Nee","Ja","Ja","Ja","Nee"]
[null,"zoet (<300 mg Cl/l)",null,"Zeer sterk",null,"Sterfte soorten van zoete milieus, effect op voedselweb (Daphnia gaat dood), oplading van waterbodem met zout","Nee","Ja","Ja","Ja","Nee"]
[null,"zoet (<300 mg Cl/l)",null,null,"Matig","Oplading van waterbodem met zout","Nee","Nee","Ja","Nee","Nee"]
[null,"zoet (<300 mg Cl/l)",null,null,"Sterk","Oplading van waterbodem met zout","Nee","Ja","Ja","Nee","Nee"]
[null,"verzoet (was brak, nu 300 - 1.000 mg Cl/l), geen zoutpieken > 1.000 mg Cl/l","Sterk",null,null,"Effect op voedselweb (Daphnia gaat dood), sterfte soorten van matig brakke milieu, kwetsbare levensfase (kieming en juveniele stadia). ","Ja","Ja","Ja","Nee","Ja"]
[null,"verzoet (was brak, nu 300 - 1.000 mg Cl/l), geen zoutpieken > 1.000 mg Cl/l","Zeer sterk",null,null,"Effect op voedselweb (Daphnia gaat dood), sterfte soorten van matig brakke milieu, kwetsbare levensfase (kieming en juveniele stadia), afname waterplanten","Ja","Ja","Ja","Ja","Ja"]
[null,"verzoet (was brak, nu 300 - 1.000 mg Cl/l), geen zoutpieken > 1.000 mg Cl/l",null,"Sterk",null,"Effect op voedselweb (Daphnia gaat dood), sterfte soorten van matig brakke milieu","Nee","Ja","Nee","Nee","Ja"]
{"$rows_left_out":18}
{"sheet":"Invoer","index":12,"n_rows":88,"n_cols":16,"rows_kept":88,"cut":false,"hidden":true,"merged":[]}
[]
[null,"INVOER ALGEMEEN"]
[null,"Bodemtype","Ontstaansgeschiedenis",null,"Aanvoer water","Verblijftijd","Peilbeheer","Eenheid zoutgehalte",null,"Verstoring",null,"Testen verstoring",null,null,"Bodemtype (helper))"]
[null,"Veen","Zoet",null,"Inlaat","< 3 dagen","Geen - vrij afstromend","EC-waarde",null,"Verzilting",null,"Nee",null,null,{"$f":"IF(B4=bodemtype,\"\",Invoer!B4)","v":"Veen"},{"$f":"_xlfn._xlws.FILTER(O4:O8,O4:O8<>\"\")","v":"Veen"}]
[null,"Klei","Brak",null,"Kwel","3 - 21 dagen","Afstromend - gestuwd","Chloridegehalte",null,"Verzoeting",null,"Ja - verstoring",null,null,{"$f":"IF(B5=bodemtype,\"\",Invoer!B5)","v":"Klei"},"Klei"]
[null,"Zavel (zwaar)",null,null,"Regen","> 21 dagen","Vast peil",null,null,null,null,"Ja - fysieke ingreep",null,null,{"$f":"IF(B6=bodemtype,\"\",Invoer!B6)","v":"Zavel (zwaar)"},"Zavel (zwaar)"]
[null,"Zavel (licht)",null,null,null,null,"Zomer- en winterpeil (natuurlijk)",null,null,null,null,null,null,null,{"$f":"IF(B7=bodemtype,\"\",Invoer!B7)","v":"Zavel (licht)"},"Zavel (licht)"]
[null,"Zand",null,null,null,null,"Zomer- en winterpeil (tegen natuurlijk)",null,null,null,null,null,null,null,{"$f":"IF(B8=bodemtype,\"\",Invoer!B8)","v":"Zand"},"Zand"]
[null,null,null,null,null,null,"Flexibel peil"]
[]
{"$rows_left_out":79}
{"sheet":"Grenswaarden landbouw","index":13,"n_rows":60,"n_cols":16,"rows_kept":60,"cut":false,"hidden":true,"merged":[]}
[]
[]
[null,"Bodemtype","Tolerantie gewas","Maximale EC irrigatiewater","Chloridegehalte",null,null,null,null,null,null,null,null,null,"chloridegehalte","EC"]
[null,"Klei","Gevoelig",2,400,null,null,null,null,null,null,null,null,null,100,0.7]
[null,"Zavel (zwaar)","Gevoelig",2.5,550,null,null,null,null,null,null,null,null,null,300,1.5]
[null,"Zavel (licht)","Gevoelig",3,750,null,null,null,null,null,null,null,null,null,400,2]
[null,"Zand","Gevoelig",3,750,null,null,null,null,null,null,null,null,null,550,2.5]
[null,"Veen","Gevoelig",2.5,550,null,"redelijk uniek i.c.m. landbouw. Groot bufferend vermogen",null,null,null,null,null,null,null,750,3]
[null,"Klei","Matig tolerant",3,750,null,"disclaimer voor veen, heel weinig kennis over",null,null,null,null,null,null,null,1100,4]
[null,"Zavel (zwaar)","Matig tolerant",5.5,1600,null,"niet zo erg als klei, maar niet zo makkelijk als zand",null,null,null,null,null,null,null,2400,7.5]
{"$rows_left_out":51}
{"sheet":"Grenswaarden Terrestrisch","index":14,"n_rows":62,"n_cols":6,"rows_kept":62,"cut":false,"hidden":true,"merged":[]}
[]
[]
["Natuurdoel (NNN beheertypen)","kritische grens verzoeting","kritische grens verzilting","kritische grens voor dit afwegingskader","Toelichting","Zouttolerantie"]
[null,"(mg Cl/l)","(mg Cl/l)"]
["N01.03-Rivier- en moeraslandschap","n.v.t.",300,300," brede standplaats","tolerant"]
["N05.02-Gemaaid rietland","n.v.t.",300,300,null,"tolerant"]
["N05.03-Veenmoeras","n.v.t.",300,300,null,"tolerant"]
["N05.04-Dynamisch Moeras","n.v.t.",300,300,null,"tolerant"]
["N12.02-Kruiden- en faunarijk grasland","n.v.t.",300,300,null,"tolerant"]
["N12.04-Zilt- en overstromingsgrasland","n.v.t. (1000/3000)","n.v.t.","n.v.t.","-    grens 1.000: 26AB02, 26AB04, 26AC01B, 26RG04","tolerant"]
{"$rows_left_out":52}