{"text_format":"1","workbook":"xlsx","n_sheets":15,"sheets":["Introductie","1. Algemeen","2. Landbouw","3. KRW","4. Terrestrisch","5. Overig","6. Dashboard Risico's","Risicolegger landbouw","Risicolegger KRW","Risicolegger Terrestrisch","Risicolegger Overig","Grenswaarden KRW","Invoer","Grenswaarden landbouw","Grenswaarden Terrestrisch"],"not_rendered":{"charts":1,"images":1,"macros":1,"external_links":0,"defined_names":51,"comments":0,"pivot_tables":0},"unopened":[],"bounds":{"document_bytes":16777216,"sheet_cells":100000,"rows_first":2000,"rows_last":500,"rows_between":2000,"halvings":0,"cell_chars":16384,"cell_head_chars":4096},"cells_cut":0,"cells_raw":0,"read":"whole","date_system":"1900"}

{"sheet":"Introductie","index":0,"n_rows":42,"n_cols":7,"rows_kept":42,"cut":false,"hidden":false,"merged":[[33,6,36,6]]}
[]
[null,null,"AFWEGINGSKADER - HOE OM TE GAAN MET ZOET-ZOUT DYNAMIEK?"]
[]
[]
[null,null,"Woord vooraf"]
[null,null,"Deze excel bundelt veel verschillende kennis om risico's aangaande de zoet-zout dynamiek te bepalen. De meeste vragen en risicobepalingen zijn voorzien van bijschriften, die meer informatie geven over wat met de vraag wordt bedoeld of hoe u de risico's kunt interpreteren. Let op! Lees de bijschriften goed door."]
[]
[null,null,"Advies: gebruik deze excel op een groot scherm."]
[]
[]
[]
[null,null,"1. HOE GEBRUIK IK DEZE EXCEL? - MACRO'S TOESTAAN",null,null,null,"3. WIE HEB IK NODIG?"]
[]
[null,null,"Deze excel maakt gebruik van macro's om de invoer voor de gebruiker te stroomlijnen en alleen de vragen en resultaten te laten zien die passen bij uw vraagstuk/projectgebied. De invoerkeuzes die de gebruiker maakt, beïnvloeden welke volgende vragen er wel of niet worden gesteld. Dit geschiedt door het tonen of verbergen van regels d.m.v. macro's. De macro's hebben alleen invloed op het wel/niet tonen van specifieke regels in dit excel document en hebben geen invloed op uw andere documenten.",null,null,null,"Voor het invullen van het afwegingskader is het verstandig om de juiste expertises te betrekken om een zo compleet mogelijk beeld te krijgen van de verwachte risico's op de zoet-zout dynamiek. De algemene vragen kunnen door waterbeheerders worden ingevuld. Voor de verdiepende vragen bij de functies landbouw wordt het aangeraden om agrariërs uit het projectgebied te betrekken. Voor de vragen over natuur kan het beste een ecoloog worden ingeschakeld die bekend is met het projectgebied."]
[]
[null,null,"Het is essentieel dat u de macro's toestaat. Zonder macro's werkt deze excel niet. De eerste keer dat u het document opent, krijgt u waarschijnlijk de melding om macro's toe te staan. Sta dit toe.",null,null,null,"Ook voor het beoordelen van de risico's is het zinvol om agrariërs en/of ecologen te betrekken, om de risico's in de juiste context te plaatsen.\n"]
[null,null,"Krijgt u geen melding en werken de macro's niet, dan kunt u de volgende stappen doorlopen:",null,null,null,"- waterbeheerder"]
[null,null,"> Ga naar het tabblad Bestand/File (linksbovenaan in Excel) en kies Opties/Options.",null,null,null,"- agrariërs (voor de functie landbouw)"]
[null,null,"> Selecteer Vertrouwenscentrum/Trust Center en kies vervolgens Instellingen voor vertrouwenscentrum/Trust Center settings en daarna het tabblad Macro's/Macro settings.",null,null,null,"- ecologen (voor de functies aquatische en terrestrische natuur)"]
[null,null,"> Kies eerst de optie 'Alle macro's met melding uitschakelen'/'Disable VBA macros with notification', herstart excel en open het bestand. Als het goed is, krijgt u bovenaan een gele banner-melding over de macro's. Sta deze toe."]
[null,null,"> Let op! Zijn alle opties grijs en kunt u geen wijzigingen doorvoeren? Dan heeft u niet de rechten. Neem in dat geval contact op met uw ICT afdeling."]
[null,null,"> Krijgt u nog steeds geen melding? Doorloop dan de eerste twee stappen nog een keer, maar selecteer dan 'Alle macro's inschakelen'/'Enable VBA macros'."]
[null,null,"> Werkt dit nog steeds niet? Zet dan in het Vertouwenscentrum/Trust Center de stand terug naar 'Alle macro's met melding uitschakelen'/'Disable VBA macros with notification' en sluit excel. Download het bestand opnieuw en let erop dat u bij de eerste keer openen de gele banner-melding toestaat."]
[null,null,"> Loopt u nog steeds tegen het probleem aan dat u de macro's niet kunt toestaan? U kunt aanvullende stappen doorlopen op de volgende website, maar als dit niet werkt, wendt u zich dan tot uw ICT afdeling."]
[null,null,"Ondersteuning voor verdere trouble-shooting om macro's toe te staan."]
[]
[]
[]
[null,null,"2. OPBOUW AFWEGINGSKADER",null,null,null,"4. HOE GA IK OM MET DE UITKOMSTEN?"]
[]
[null,null,"Om een afweging te kunnen maken hoe om te gaan met de zoet-zout dynamiek, is het zaak om de juiste gegevens te verzamelen. Gegevens over bijvoorbeeld het waterbeheer, zoutgehaltes en bodemeigenschappen zijn nodig om een eerste inschatting van de risico's te bepalen ten aanzien van verzilting en verzoeting. Voor een navolgbare redeneerlijn, zijn de vragen voor de gebruiker gebundeld in verschillende blokken. Deze blokken zijn:",null,null,null,"Het afwegingskader berust op de laatste kennis omtrent de hydrologische, biogeochemische en biologische processen die een effect uitoefenen op de aquatische natuur, terrestrische natuur en landbouw. Op basis van deze kennis is getracht te komen tot grenswaarden (m.b.v. deskundigenoordelen van The Salt Doctors, Van Geest Ecologie en Witteveen+Bos). Een belangrijke kanttekening is dat deze grenswaarden maar zo gedetailleerd kunnen zijn als de huidige kennis toe staat. Hierbij is ervoor gekozen om aan de voorzichtige kant te zitten en risico's sneller als hoger in te schatten."]
[null,null,"1. Algemeen: in dit blok worden het projectgebied afgebakend en worden algemene vragen gesteld over het projectgebied, over de functies die aan het projectgebied worden toegekend en welke problematiek er thans speelt (nl.: verzilting of verzoeting).\nOp basis van de functies die de gebruiker selecteert, worden verdere vragen gesteld over de landbouw (2), de aquatische natuur (3), de terrestrische natuur (4) en overig (5).",null,null,null,"Daarnaast zijn er voor veel processen nog geen grenswaarden bekend, ook niet met een deskundigenoordeel. Het afwegingskader in huidige vorm voorziet een raamwerk waar voortschrijdend inzicht kan worden ingebouwd. Dit kan betekenen dat het invullen van het afwegingskader op het moment van schrijven (2024) een ander oordeel kan geven in vergelijking met mogelijke toekomstige versies."]
[null,null,"2. Landbouw: in dit blok worden gegevens opgehaald specifiek gericht op de functie landbouw.",null,null,null,"Maatwerk (quickscan - nadere analyse)"]
[null,null,"3. KRW: in dit blok worden gegevens opgehaald specifiek gericht op de functie aquatische natuur en de doelen vanuit de KRW.",null,null,null,"Deze tool is in eerste plaats bedoeld voor het maken van een zogenaamde quickscan. Na het invullen van de vragen, krijgt u op het Dashboard een overzicht van de risico's t.a.v. zoet-zout dynamiek. Om beter te begrijpen hoe de zoet-zout dynamiek in uw projectgebied doorwerkt op de risico's en te toetsen hoe het risico ontstaat, kunt u invoerwaardes systematisch aanpassen. Bijvoorbeeld door het bodemtype van lichte zavel naar klei aan te passen of de zoutpiek groter of kleiner te maken, en vervolgens te kijken hoe het risico verandert. Op het dashboard staan bijschriften die u helpen de resultaten/risico's te interpreteren. Op deze manier maakt deze tool/ dit afwegingskader het mogelijk om nader te toetsen."]
[null,null,"4. Terrestrisch: in dit blok worden gegevens opgehaald specifiek gericht op de terrestrische natuur."]
[null,null,"5. Overig: Overige functies die zich niet in een van de vorige drie blokken laten indelen, maar wel zinvol zijn om mee te nemen in de uiteindelijke eindafweging, worden in dit blok behandeld."]
[null,null,"6. Dashboard: een dashboard met een samenvatting van de risico-bepalingen op basis van de ingevoerde gegevens. De risico's en nuances worden toonbaar gemaakt aan de gebruiker. Het maken van een eindoordeel ligt bij de gebruiker."]
[null,null,"De gebruiker start op het tabblad 1. Algemeen. Op basis van de invoer wordt doorverwezen naar welke andere tabbladen ingevuld dienen te worden."]
[null,null,null,null,null,null,"Zoet-zout dynamiek in relatie tot droogte"]
[null,null,"Voor een meer gedetailleerd overzicht van de risico's kunt u kijken op paarse tabbladen (de risicoleggers). Hier is per functie nader uitgewerkt hoe de invoer, specifiek voor het projectgebied, doorwerkt op de functies in termen van zoet-zout dynamiek.",null,null,null,"In dit afwegingskader wordt puur gekeken naar de risico's t.a.v. zoet-zout dynamiek. Er zijn echter voorbeelden denkbaar dat het zoet-zout dynamiek vraagstuk nauw samenhangt met droogte-problematiek. Risico's t.a.v. droogte worden hier niet bepaald. Het is aan de gebruiker om de resultaten van de zoet-zout dynamiek zelf, met bijv. een expertteam, in de context te plaatsen van droogte-problematiek, als dit in uw projectgebied speelt."]
[]
[null,null,"N.B.: Meer gegevens geven een completer beeld voor het maken van de risicobepaling. Het kan echter zo zijn dat de gebruiker niet over alle gegevens beschikt die worden opgevraagd. Ook bij minimale invoer tracht het afwegingskader inzicht te geven."]

{"sheet":"1. Algemeen","index":1,"n_rows":106,"n_cols":27,"rows_kept":106,"cut":false,"hidden":false,"merged":[[62,4,62,7],[75,2,78,10],[65,2,65,10]]}
[]
[]
[null,null,"Afbakening projectgebied voor afwegingskader"]
[]
[null,null,"Wat is het schaalniveau* waarvoor u het afwegingskader gebruikt (zelf invullen, geen keuzemenu)?",null,null,null,null,null,null,null,null,null,null,null,"Legenda"]
[null,null,"  Bijv.: individuele polder, boezemsysteem, geheel beheergebied"]
[null,null,null,null,null,null,null,null,null,null,null,null,null,null,null,null,"Een invulveld waar nog geen waarde is ingevuld*"]
[null,null,"*De rest van de vragen in dit afwegingskader gaan over dit projectgebied",null,null,null,null,null,null,null,null,null,null,null,null,null,"Een invulveld waar een correcte waarde is ingevuld"]
[null,null,null,null,null,null,null,null,null,null,null,null,null,null,null,null,"Een klik-keuze menu**"]
[null,null,null,null,null,null,null,null,null,null,null,null,null,null,null,null,"Een veld dat, afhankelijk van de invoer van andere vragen, een invulveld wordt of instructies geeft"]
[]
[null,null,"Gebiedsinformatie",null,null,null,null,null,null,null,null,null,null,null,null,null,"N.B. Alleen gegevens in groene velden wordt meegenomen in de afweging"]
[]
[null,null,"  In dit blok worden algemene vragen gesteld over de ontstaansgeschiedenis van uw projectgebied, hoe het huidig waterbeheer is geregeld en "]
[null,null,"  wat de huidige zoutsituatie is."]
[]
[null,null,"Ontstaansgeschiedenis"]
[null,null,"Wat is het meest voorkomende bodemtype?",null,null,null,null,null,null,null,null,null,null,null,null,null,"*als de cel geen dropdownlijst bevat, dan dient u zelf een antwoord in te vullen."]
[null,null,"Welke andere bodemtypes komen voor?",null,null,null,null,null,null,null,null,null,null,null,null,null,"**het klik-keuze menu stelt u in staat om meerdere keuzes door te geven"]
[null,null,"  Voor uitleg over de manier van invoer bij deze vraag, zie legenda."]
[null,null,"In welk type milieu (zoet of brak) is het projectgebied ontstaan?",null,null,null,null,null,null,null,null,null,null,null,null,null,"het klik-keuze menu werkt als volgt:"]
[null,null,"  Meer specifiek: is de bodemlaag die nu aan het oppervlak ligt gevormd onder brakke of zoete omstandigheden?",null,null,null,null,null,null,null,null,null,null,null,null,null,"1. Klik op het paarse vlak"]
[null,null,"Wat is nu het heersende milieu (zoet of brak) in het projectgebied?",null,null,null,null,null,null,null,null,null,null,null,null,null,"2. Maak een keuze"]
[null,null,"  Meer specifiek: is het oppervlaktewater nu overheersend zoet (<300 mg Cl/l of EC < 2) of brak?",null,null,null,null,null,null,null,null,null,null,null,null,null,"3. Wilt u nog een optie toevoegen, herhaal dan stap 1 en 2"]
[null,null,null,null,null,null,null,null,null,null,null,null,null,null,null,null,"4. Heeft u een fout gemaakt, of wilt u een nieuwe situatie invullen?"]
[null,null,"Huidig waterbeheer",null,null,null,null,null,null,null,null,null,null,null,null,null,"    Klik dan op het groene vak direct rechts van het keuzemenu (in kolom K)"]
[null,null,"  Als er binnen het projectgebied regionale verschillen zijn in waterbeheer, kies hier dan waardes die zo representatief",null,null,null,null,null,null,null,null,null,null,null,null,null,"    en druk de DELETE knop op uw toetsenbord in."]
[null,null,"  mogelijk zijn voor het hele projectgebied (of kies ervoor om een kleiner schaalniveau toe te passen)."]
[null,null,"Hoe is de aanvoer van water in het watersysteem hoofdzakelijk geregeld?"]
[null,null,"Wat is de verblijftijd?"]
[null,null,"Wat is het leidend peilbeheer?"]
[null,null,"Heeft u de STOWA toets 'Inlaatwater vs. gebiedsvreemdwater' doorlopen?",null,null,null,null,null,null,"link"]
[null,null,null,{"$f":"IF(toets_inlaatwater=\"Ja\",\"Wat zijn de redenen om water wel in te laten?\",IF(toets_inlaatwater=\"Nee\",\"N.B.: Deze toets geeft een aanvullend inzicht over andere aspecten dan alleen zoet of zout. Dit inzicht kan ook nuttig zijn voor het maken\",\"\"))","v":""}]
[null,null,null,{"$f":"IF(toets_inlaatwater=\"Ja\",\"Wat zijn de redenen om water niet in te laten?\",IF(toets_inlaatwater=\"Nee\",\"        van een risicobepaling t.a.v. de zoet-zout dynamiek in het projectgebied.\",\"\"))","v":""}]
[]
[null,null,"Zout (huidige situatie)"]
[null,null,"  Vul hier de zoutsituatie van de huidige situatie in. Dit kunt u zien als de nulsituatie waar u een verstoring of"]
[null,null,"  ander zoutscenario mee kunt vergelijken. Let op, ook in de huidige situatie kunnen er al aanleidingen zijn "]
[null,null,"  voor een verhoogd risico t.a.v. de zoet-zout dynamiek."]
[null,null,"In welke eenheid wilt u gegevens opgegeven over het zoutgehalte van het oppervlaktewater?"]
[null,null,"Wat is de huidige situatie van het zoutgehalte in het oppervlaktewater?"]
[null,null,"  Vul op z'n minst een zomerhalfjaar- of jaargemiddelde in. Meer informatie geeft een beter overzicht."]
[null,null,"  N.B.: in de deze versie van het afwegingskader wordt alleen gerekend met de hoogste waarde (bij verzilting) "]
[null,null,"  of de laagste waarde (bij verzoeting) die u invult."]
[null,null,null,{"$f":"IF(eenheid_zoutgehalte_algemeen=Invoer!$H$4,\"Minimale EGV-waarde (dS/m)\",IF(eenheid_zoutgehalte_algemeen=Invoer!$H$5,\"Minimaal chloridegehalte (mgCl/l)\",\"… maak eerst een keuze voor eenheid van het zoutgehalte ...\"))","v":"… maak eerst een keuze voor eenheid van het zoutgehalte ..."},null,null,null,null,null,null,null,null,null,null,null,null,null,null,null,null,null,null,null,null,null,{"$f":"MAX(K45:K48)","v":0},"maximaal_zoutgehalte_huidig"]
[null,null,null,{"$f":"IF(eenheid_zoutgehalte_algemeen=Invoer!$H$4,\"Zomerhalfjaargemiddelde EGV-waarde (dS/m)\",IF(eenheid_zoutgehalte_algemeen=Invoer!$H$5,\"Zomerhalfjaargemiddelde chloridegehalte (mgCl/l)\",\"\"))","v":""},null,null,null,null,null,null,null,null,null,null,null,null,null,null,null,null,null,null,null,null,null,{"$f":"MIN(K45:K48)","v":0},"minimaal_zoutgehalte_huidig"]
[null,null,null,{"$f":"IF(eenheid_zoutgehalte_algemeen=Invoer!$H$4,\"Jaargemiddelde EGV-waarde (dS/m)\",IF(eenheid_zoutgehalte_algemeen=Invoer!$H$5,\"Jaargemiddelde chloridegehalte (mgCl/l)\",\"\"))","v":""}]
[null,null,null,{"$f":"IF(eenheid_zoutgehalte_algemeen=Invoer!$H$4,\"Maximale EGV-waarde (dS/m)\",IF(eenheid_zoutgehalte_algemeen=Invoer!$H$5,\"Maximaal chloridegehalte (mgCl/l)\",\"\"))","v":""}]
[null,null,{"$f":"IF(AND(heersend_milieu=\"brak\",\n       OR(AND(eenheid_zoutgehalte_algemeen=\"Chloridegehalte\", MAX(K45:K48)<300),\n          AND(eenheid_zoutgehalte_algemeen=\"EC-waarde\", MAX(K45:K48)<2))\n    ), \"De ingevulde waarde(s) lijk(t)(en) te laag voor het ingevulde heersende milieu. Oordeel zelf of het heersende milieu klopt.\",\n    IF(AND(heersend_milieu=\"zoet\",\n           OR(AND(eenheid_zoutgehalte_algemeen=\"Chloridegehalte\", MAX(K45:K48)>300),\n              AND(eenheid_zoutgehalte_algemeen=\"EC-waarde\", MAX(K45:K48)>2))\n    ), \"De ingevulde waarde(s) lijk(t)(en) te hoog voor het ingevulde heersende milieu. Oordeel zelf of het heersende milieu klopt.\", \"\"))","v":""}]
[]
[]
[]
[null,null,"Gebruiksfuncties"]
[]
[null,null,"  In dit blok kunt u aangeven hoe het projectgebied wordt gebruikt en welke doelen er worden nagestreeft."]
[null,null,"  Let op! Alleen de functies die u hier aanvinkt, worden opgenomen in het dashboard."]
[null,null,"Welke functies heeft het gebied?"]
[null,null,"Landbouw",null,null,false,null,null,null,null,{"$f":"IF($F$58=TRUE,\"  vul formulier 2. Landbouw in\",\"\")","v":""}]
[null,null,"Onderwaternatuur",null,null,false,null,null,null,null,{"$f":"IF($F$59=TRUE,\"  vul formulier 3. KRW in\",\"\")","v":""}]
[null,null,"Terrestrische natuur",null,null,false,null,null,null,null,{"$f":"IF($F$60=TRUE,\"  vul formulier 4. Terrestrische natuur in\",\"\")","v":""}]
[null,null,"Drinkwater",null,null,false,null,null,null,null,{"$f":"IF($F$61=TRUE,\"  vul formulier 5. Overig in\",\"\")","v":""}]
[null,null,"Infrastructuur",null,null,false,null,null,null,null,{"$f":"IF($F$62=TRUE,\"  vul formulier 5. Overig in\",\"\")","v":""}]
[null,null,"Overig, nl.:",null,null,null,null,null,null,null,{"$f":"IF($E$63<>\"\",\"  vul formulier 5. Overig in\",\"\")","v":""}]
[]
[null,null,"Welke (wettelijke) doelen streeft u na in het projectgebied?"]
[null,null,"  Vraag is bedoeld voor persoonlijk overzicht. Keuze beïnvloedt in huidige versie van het afwegingskader niet de vraagstelling op de andere tabbladen."]
[null,null,"N2000",null,null,false]
[null,null,"KRW",null,null,false]
[null,null,"Doelen overig water",null,null,false]
[null,null,"NNN",null,null,false]
[]
[]
[]
[null,null,"Aard van de verstoring"]
[]
[null,null,"In dit blok kunt u aangeven op welke (toekomstige) verstoring van zoet-zout dynamiek u uw projectgebied wilt toetsen. Dit wordt vergeleken met de huidige situatie die u in het blok \"Gebiedsinformatie\" op dit tabblad heeft ingevuld. Als u alleen de huidige situatie wilt toetsen, dan vult u hieronder \"Nee\" in. Vult u \"Ja\" in, dan worden risico's bepaald voor zowel de huidige situatie als voor een toekomstige situatie.\n\nN.B.1: In feite kunt u dus met dit afwegingskader 2 zoutscenario’s met elkaar vergelijken voor uw projectgebied. Hoewel het afwegingskader in eerste instantie is ontwikkeld om de huidige zoutsituatie in het veld te vergelijken met een toekomstige verzilting/verzoeting, is het ook denkbaar om bijvoorbeeld de huidige situatie te vergelijken met streefwaarden van het voorgeschreven waterbeheer. Als u dergelijke scenario's gaat toetsen, wees dan alert welke zoutsituatie u waar heeft ingevuld om de resultaten juist te kunnen interpreteren.\n\nN.B.2: In de huidige versie van het afwegingskader kunt u op alleen een verstoring (verzilting/verzoeting) of op fysieke ingreep testen. Niet tezamen."]
[]
[]
[]
[]
[]
[null,null,"Verstoring testen?"]
[null,null,"Wilt u de effecten van een verstoring (verzilting of verzoeting) of fysieke ingrepen testen?"]
[null,null,"  Denk bij fysieke ingrepen bijvoorbeeld aan damwanden tegen brakke kwel."]
[null,null,{"$f":"IF(bool_toets_verstoring=\"Nee\",\"  N.B. Dit betekent dat er geen risicobepaling wordt opgesteld voor een verstoring of fysieke ingreep.\",IF(LEFT(bool_toets_verstoring,2)=\"Ja\",\"  Vul onderstaande gegevens in voor zover mogelijk. Het betreft moeilijke vragen waar niet altijd een duidelijk antwoord op is.\",\"\"))","v":""}]
[]
[null,null,"Eigenschappen verstoring"]
[null,null,"Betreft de verstoring een (tijdelijke) verzilting of verzoeting van het oppervlaktewater?"]
[null,null,"  Probeer voor zoveel mogelijk parameters een antwoord te formuleren."]
[null,null,null,{"$f":"IF(AND(eenheid_zoutgehalte_algemeen=Invoer!$H$4,verstoring_type=Invoer!$J$4),\"Maximale EGV-waarde (dS/m)\",\nIF(AND(eenheid_zoutgehalte_algemeen=Invoer!$H$4,verstoring_type=Invoer!$J$5),\"Minimale EGV-waarde (dS/m)\",\nIF(AND(eenheid_zoutgehalte_algemeen=Invoer!$H$5,verstoring_type=Invoer!$J$4),\"Maximaal chloridegehalte (mg Cl/l)\",\nIF(AND(eenheid_zoutgehalte_algemeen=Invoer!$H$5,verstoring_type=Invoer!$J$5),\"Minimaal chloridegehalte (mg Cl/l)\",IF(verstoring_type<=\"\",\"... maak eerst een keuze van het type verstoring ...\",\"N.B.: maak eerst een keuze onder 'Gebiedsinformatie - zout - eenheid\")))))","v":"... maak eerst een keuze van het type verstoring ..."},null,null,null,null,null,null,null,null,null,null,null,null,null,null,null,null,null,null,null,null,null,{"$f":"IF(verstoring_type=\"Verzilting\",verstoring_zoutgehalte)","v":false},"maximaal_zoutgehalte_verstoring"]
[null,null,null,{"$f":"IF(verstoring_type<>\"\",\"Frequentie van de verstoring\",\"\")","v":""},null,null,{"$f":"IF(verstoring_type<>\"\",\"aantal keer per jaar\",\"\")","v":""},null,null,null,null,null,null,null,null,null,null,null,null,null,null,null,null,null,null,{"$f":"IF(verstoring_type=\"Verzoeting\",verstoring_zoutgehalte)","v":false},"minimaal_zoutgehalte_verstoring"]
[null,null,null,{"$f":"IF(verstoring_type<>\"\",\"Tijdsinterval\",\"\")","v":""},null,null,{"$f":"IF(verstoring_type<>\"\",\"gemiddeld aantal dagen tussen verstoringen\",\"\")","v":""}]
[null,null,null,{"$f":"IF(verstoring_type<>\"\",\"Duur\",\"\")","v":""},null,null,{"$f":"IF(verstoring_type<>\"\",\"gemiddeld aantal dagen\",\"\")","v":""}]
[null,null,null,{"$f":"IF(verstoring_type<>\"\",\"Moment\",\"\")","v":""},null,null,{"$f":"IF(verstoring_type<>\"\",\"maanden in het jaar\",\"\")","v":""}]
[null,null,null,{"$f":"IF(verstoring_type<>\"\",\"Omvang (ha)\",\"\")","v":""},null,null,{"$f":"IF(verstoring_type<>\"\",\"grootte van het gebied (ha)\",\"\")","v":""}]
[null,null,null,{"$f":"IF(verstoring_type<>\"\",\"Omvang (%)\",\"\")","v":""},null,null,{"$f":"IF(verstoring_type<>\"\",\"percentage van het projectgebied\",\"\")","v":""}]
[]
[null,null,"Fysieke ingrepen tegen zoet-zout dynamiek"]
[null,null,"Wat is het verwachte zoutgehalte in het oppervlaktewater na het uitvoeren van deze ingrepen?"]
[null,null,"  Vul op z'n minst een waarde in. Meer informatie geeft een beter overzicht."]
[null,null,null,{"$f":"IF(eenheid_zoutgehalte_algemeen=Invoer!$H$4,\"Minimale EGV-waarde (dS/m)\",IF(eenheid_zoutgehalte_algemeen=Invoer!$H$5,\"Minimaal chloridegehalte (mgCl/l)\",\"maak eerst een keuze onder 'Gebiedsinformatie - zout - eenheid'\"))","v":"maak eerst een keuze onder 'Gebiedsinformatie - zout - eenheid'"},null,null,null,null,null,null,null,null,null,null,null,null,null,null,null,null,null,null,null,null,null,{"$f":"MAX(K101:K104)","v":0},"maximaal_zoutgehalte_ingreep"]
[null,null,null,{"$f":"IF(eenheid_zoutgehalte_algemeen=Invoer!$H$4,\"Zomerhalfjaargemiddelde EGV-waarde (dS/m)\",IF(eenheid_zoutgehalte_algemeen=Invoer!$H$5,\"Zomerhalfjaargemiddelde chloridegehalte (mgCl/l)\",\"\"))","v":""},null,null,null,null,null,null,null,null,null,null,null,null,null,null,null,null,null,null,null,null,null,{"$f":"MIN(K101:K104)","v":0},"minimaal_zoutgehalte_ingreep"]
[null,null,null,{"$f":"IF(eenheid_zoutgehalte_algemeen=Invoer!$H$4,\"Jaargemiddelde EGV-waarde (dS/m)\",IF(eenheid_zoutgehalte_algemeen=Invoer!$H$5,\"Jaargemiddelde chloridegehalte (mgCl/l)\",\"\"))","v":""}]
[null,null,null,{"$f":"IF(eenheid_zoutgehalte_algemeen=Invoer!$H$4,\"Maximale EGV-waarde (dS/m)\",IF(eenheid_zoutgehalte_algemeen=Invoer!$H$5,\"Maximaal chloridegehalte (mgCl/l)\",\"\"))","v":""},null,null,null,null,null,null,null,null,null,null,null,null,null,null,null,null,null,null,null,null,null,{"$f":"IF(bool_toets_verstoring=\"Ja - verstoring\",maximaal_zout_verstoring,IF(bool_toets_verstoring=\"Ja - fysieke ingreep\",maximaal_zoutgehalte_ingreep,\"\"))","v":""},"maximaal_zoutgehalte_toekomst"]
[null,null,{"$f":"IF(AND(F58=TRUE,F59=FALSE,F60=FALSE,OR(bool_toets_verstoring=\"Ja - verstoring\",bool_toets_verstoring=\"Ja - fysieke ingreep\")),\"Let op! Als u alleen op de functie landbouw toetst en er wordt geïrrigeerd met een water anders dan het oppervlaktewater, \",\"\")","v":""}]
[null,null,{"$f":"IF(AND(F58=TRUE,F59=FALSE,F60=FALSE,bool_toets_verstoring=\"Ja - verstoring\"),\"dan hoeft u alleen de type verstoring (verzilting/verzoeting) op te geven. De andere vragen onder 'Eigenschappen verstoring' kunt u leeglaten.\",IF(AND(F58=TRUE,F59=FALSE,F60=FALSE,bool_toets_verstoring=\"Ja - fysieke ingreep\"),\"dan hoeft u hier geen waardes in te vullen.\",\"\"))","v":""}]

{"sheet":"2. Landbouw","index":2,"n_rows":88,"n_cols":27,"rows_kept":88,"cut":false,"hidden":false,"merged":[[25,14,26,24]]}
[]
[]
[null,null,"Agrarisch grondgebruik",null,null,null,null,null,null,null,null,null,null,null,null,"Legenda"]
[]
[null,null,"  In dit blok wordt gevraagd welke doelgewassen worden gebruikt. Voor een eenvoudig overzicht kiest u hier voor 1 doelgewas. U kunt ook meerdere"]
[null,null,"  doelgewassen tegelijkertijd selecteren.",null,null,null,null,null,null,null,null,null,null,null,null,null,null,"Een invulveld waar nog geen waarde is ingevuld*"]
[null,null,null,null,null,null,null,null,null,null,null,null,null,null,null,null,null,"Een invulveld waar een correcte waarde is ingevuld"]
[null,null,"Welk van onderstaande doelgewassen worden er geteeld?",null,null,null,null,null,null,null,null,null,null,null,null,null,null,"Een klik-keuze menu**"]
[null,null,"  Ga hierbij uit van een periode van 5 jaar in het geval van wisselteelt.",null,null,null,null,null,null,null,null,null,null,null,null,null,null,"Een veld dat, afhankelijk van de invoer van andere vragen, een invulveld wordt of instructies geeft"]
[null,null,"Gras",null,null,false]
[null,null,"(Zomer)tarwe",null,null,false,null,null,null,null,null,null,null,null,null,null,null,"N.B. Alleen gegevens in groene velden wordt meegenomen in de afweging"]
[null,null,"Aardappel",null,null,false,null,null,null,null,null,null,null,null,null,null,null,"*als de cel geen dropdownlijst bevat, dan dient u zelf een antwoord in te vullen."]
[null,null,"(Snij)maïs",null,null,false]
[null,null,"Suikerbiet",null,null,false,null,null,null,null,null,null,null,null,null,null,null,"**het klik-keuze menu stelt u in staat om meerdere keuzes door te geven"]
[null,null,"Ui",null,null,false,null,null,null,null,null,null,null,null,null,null,null,"het klik-keuze menu werkt als volgt:"]
[null,null,"Gerst",null,null,false,null,null,null,null,null,null,null,null,null,null,null,"1. Klik op het paarse vlak"]
[null,null,"Tulp",null,null,false,null,null,null,null,null,null,null,null,null,null,null,"2. Maak een keuze"]
[null,null,"Peer",null,null,false,null,null,null,null,null,null,null,null,null,null,null,"3. Wilt u nog een optie toevoegen, herhaal dan stap 1 en 2"]
[null,null,"Lelie",null,null,false,null,null,null,null,null,null,null,null,null,null,null,"4. Heeft u een fout gemaakt, of wilt u een nieuwe situatie invullen?"]
[null,null,"Overige boomsoorten",null,null,false,null,null,null,null,null,null,null,null,null,null,null,"    Klik dan op het groene vak direct rechts van het keuzemenu (in kolom K)"]
[null,null,null,null,null,null,null,null,null,null,null,null,null,null,null,null,null,"    en druk de DELETE knop op uw toetsenbord in."]
[]
[]
[null,null,"Irrigatiewater"]
[]
[null,null,"  In dit blok wordt informatie opgehaald over de manier van irrigeren en de waterkwaliteit hiervan t.a.v. zoet-zout dynamiek.",null,null,null,null,null,null,null,null,null,null,null,"Capillaire opstijging wordt niet meegenomen in de bepaling van effecten op de landbouw, voornamelijk omdat de invloed op capillaire opstijging zeer beperkt is en de hoofdmodus van effecten te wijten is aan irrigatie."]
[]
[null,null,"Is er sprake van irrigatie?"]
[null,null,"  Irrigatie is synoniem aan beregening. De term irrigatie wordt gebruikt voor het actief"]
[null,null,"  toevoegen van water aan landbouwgewassen."]
[null,null,"Welke techniek van irrigatie wordt er toegepast?",null,null,null,null,null,null,null,null,null,null,{"$f":"IF(K31=Invoer!C14,1,IF(irrigatie_techniek<>\"\",0,2))","v":2}]
[null,null,"Hoe vaak wordt er per jaar gemiddeld geïrrigeerd? (aantal giften)"]
[null,null,"Wat is de gemiddelde grootte van de gift (in mm) per irrigatiemoment?",null,null,null,null,null,null,null,null,null,null,null,null,null,null,null,null,null,null,null,null,null,null,null,{"$f":"K32*K33","v":0}]
[null,null,"In welke maanden wordt er geïrrigeerd? "]
[null,null,"  Ga hierbij uit van een normaal jaar zonder extreme droogte. Voor uitleg over de manier van invoer bij deze vraag, zie legenda."]
[null,null,"  "]
[null,null,"Wordt het oppervlaktewater als irrigatiewater gebruikt?"]
[null,null,{"$f":"IF($K$37=\"Nee\", \"  U geeft aan dat u ander water gebruikt voor irrigatie dan het oppervlaktewater.\", IF($K$37=\"Ja\", \"  De waardes voor het huidige en, indien opgegeven, toekomstige zoutgehalte van het oppervlaktewater uit tabblad 1. Algemeen\",\"\"))","v":""}]
[null,null,{"$f":"IF($K$37=\"Nee\",\"  Er zijn daarom aanvullende gegevens nodig over het zoutgehalte van het irrigatiewater.\",IF($K$37=\"Ja\",\"  worden gebruikt als waardes voor het irrigatiewater. Er zijn hiervoor dus geen aanvullende vragen.\",\"\"))","v":""}]
[]
[null,null,"Zoutgehalte huidige situatie"]
[null,null,"  Er wordt hier opnieuw (in aanvulling op tabblad \"1. Algemeen\") gevraagd om het zoutgehalte"]
[null,null,"  in de huidige situatie. Dit komt omdat er met ander water wordt geïrrigeerd. De waardes die"]
[null,null,"  u hier invult, worden alleen toegepast op het bepalen van verwachte risico's op doelgewassen"]
[null,null,"  en niet op andere functies (bijv. natuur)."]
[null,null,"In welke eenheid wilt u gegevens opgegeven over het zoutgehalte van het oppervlaktewater?"]
[null,null,"Wat is het zoutgehalte van het irrigatiewater in de huidige situatie?"]
[null,null,"  Vul op z'n minst een zomerhalfjaar- of jaargemiddelde in. Meer informatie geeft een beter overzicht."]
[null,null,null,{"$f":"IF(eenheid_zoutgehalte_landbouw_huidig=Invoer!$H$4,\"Minimale EC-waarde (dS/m)\",IF(eenheid_zoutgehalte_landbouw_huidig=Invoer!$H$5,\"Minimaal chloridegehalte (mgCl/l)\",\"… maak eerst een keuze voor eenheid van het zoutgehalte  ...\"))","v":"… maak eerst een keuze voor eenheid van het zoutgehalte  ..."},null,null,null,null,null,null,null,null,null,null,null,null,null,null,null,null,null,null,null,null,null,null,{"$f":"MAX(K49:K52)","v":0}]
[null,null,null,{"$f":"IF(eenheid_zoutgehalte_landbouw_huidig=Invoer!$H$4,\"Zomerhalfjaargemiddelde EC-waarde (dS/m)\",IF(eenheid_zoutgehalte_landbouw_huidig=Invoer!$H$5,\"Zomerhalfjaargemiddelde chloridegehalte (mgCl/l)\",\"\"))","v":""}]
[null,null,null,{"$f":"IF(eenheid_zoutgehalte_landbouw_huidig=Invoer!$H$4,\"Jaargemiddelde EC-waarde (dS/m)\",IF(eenheid_zoutgehalte_landbouw_huidig=Invoer!$H$5,\"Jaargemiddelde chloridegehalte (mgCl/l)\",\"\"))","v":""}]
[null,null,null,{"$f":"IF(eenheid_zoutgehalte_landbouw_huidig=Invoer!$H$4,\"Maximale EC-waarde (dS/m)\",IF(eenheid_zoutgehalte_landbouw_huidig=Invoer!$H$5,\"Maximaal chloridegehalte (mgCl/l)\",\"\"))","v":""}]
[]
[null,null,"Zoutgehalte na verzilting"]
[null,null,{"$f":"IF(bool_toets_verstoring=\"Ja - verstoring\",\"  U heeft op tabblad '1. Algemeen' aangegeven dat u wilt testen op een verstoring. Omdat u met ander water irrigeert dan met oppervlaktewater, zijn specifiek voor het \",\"  U heeft op tabblad '1. Algemeen' aangegeven dat u niet wilt testen op een verstoring. Daarom wordt hier niet verder gevraagd. Wilt u toch toetsen op een verstoring\")","v":"  U heeft op tabblad '1. Algemeen' aangegeven dat u niet wilt testen op een verstoring. Daarom wordt hier niet verder gevraagd. Wilt u toch toetsen op een verstoring"}]
[null,null,{"$f":"IF(bool_toets_verstoring=\"Ja - verstoring\",\"  toetsen op een verzilting van het irrigatiewater extra vragen benodigd.\",\"  (bijvoorbeeld een verzilting van het irrigatiewater), pas dit dan aan op tabblad '1. Algemeen' en vul vervolgens de nieuwe invulvelden hier in.\")","v":"  (bijvoorbeeld een verzilting van het irrigatiewater), pas dit dan aan op tabblad '1. Algemeen' en vul vervolgens de nieuwe invulvelden hier in."}]
[null,null,"Wat is het verwachte zoutgehalte van het irrigatiewater na verzilting?",null,null,null,null,null,null,null,null,null,null,{"$f":"IF(AND(bool_toets_verstoring=\"Ja - verstoring\",bool_opp_irrigatie=\"Nee\"),1,0)","v":0}]
[null,null,"  Vul op z'n minst een zomerhalfjaar- of jaargemiddelde in. Meer informatie geeft een beter overzicht.",null,null,null,null,null,null,null,null,null,null,0]
[null,null,null,{"$f":"IF(eenheid_zoutgehalte_landbouw_huidig=Invoer!$H$4,\"Minimale EC-waarde (dS/m)\",IF(eenheid_zoutgehalte_landbouw_huidig=Invoer!$H$5,\"Minimaal chloridegehalte (mgCl/l)\",\"… maak eerst een keuze voor eenheid van het zoutgehalte  ...\"))","v":"… maak eerst een keuze voor eenheid van het zoutgehalte  ..."},null,null,null,null,null,null,null,null,null,0,null,null,null,null,null,null,null,null,null,null,null,null,{"$f":"MAX(K59:K62)","v":0}]
[null,null,null,{"$f":"IF(eenheid_zoutgehalte_landbouw_huidig=Invoer!$H$4,\"Zomerhalfjaargemiddelde EC-waarde (dS/m)\",IF(eenheid_zoutgehalte_landbouw_huidig=Invoer!$H$5,\"Zomerhalfjaargemiddelde chloridegehalte (mgCl/l)\",\"\"))","v":""},null,null,null,null,null,null,null,null,null,0]
[null,null,null,{"$f":"IF(eenheid_zoutgehalte_landbouw_huidig=Invoer!$H$4,\"Jaargemiddelde EC-waarde (dS/m)\",IF(eenheid_zoutgehalte_landbouw_huidig=Invoer!$H$5,\"Jaargemiddelde chloridegehalte (mgCl/l)\",\"\"))","v":""},null,null,null,null,null,null,null,null,null,0]
[null,null,null,{"$f":"IF(eenheid_zoutgehalte_landbouw_huidig=Invoer!$H$4,\"Maximale EC-waarde (dS/m)\",IF(eenheid_zoutgehalte_landbouw_huidig=Invoer!$H$5,\"Maximaal chloridegehalte (mgCl/l)\",\"\"))","v":""},null,null,null,null,null,null,null,null,null,0]
[]
[]
[]
[]
[null,null,"Bodemtextuur"]
[]
[null,null,"  In dit blok wordt informatie opgehaald over de bodemtextuur, een belangrijke component die de verwachte effecten van zoet-zout dynamiek op doelgewassen beïnvloedt."]
[]
[null,null,"Wat is het kleipercentage?"]
[null,null,{"$f":"IF(AND(bodemtype=\"Klei\", kleipercentage=Invoer!$E$14),\n    \"  Dit kleipercentage lijkt niet overeen te komen met het bodemtype dat is ingevuld op tabblad 1. Algemeen.\",\n    IF(AND(OR(bodemtype=\"Zand\", bodemtype=\"Zavel (licht)\"), kleipercentage=Invoer!$E$16),\n        \"  Dit kleipercentage lijkt niet overeen te komen met het bodemtype dat is ingevuld op tabblad 1. Algemeen.\",\n        \"\"))","v":""}]
[null,null,"  Bij een hoog kleipercentage maakt de bodemtextuur extra uit in het bepalen van risico's. Daarom worden aanvullende vragen gesteld."]
[]
[null,null,"Wat is het organische stofpercentage?"]
[null,null,"Hoe is het klei humuscomplex opgebouwd?"]
[null,null,null,"Percentage calcium"]
[null,null,null,"Percentage magnesium"]
[null,null,null,"Percentage natrium"]
[]
[]
[]
[]
[null,null,"Vee drenking"]
[]
[null,null,"  In dit blok wordt informatie opgehaald over of er sprake is van vee drenking."]
[]
[null,null,"Is er sprake van vee drenking?"]

{"sheet":"3. KRW","index":3,"n_rows":96,"n_cols":30,"rows_kept":96,"cut":false,"hidden":false,"merged":[[8,2,8,7],[57,2,57,8],[93,2,93,8]]}
[]
[]
[]
[null,null,"KRW-doeltypen"]
[]
[null,null,"In dit blok kunt u aangeven welk(e) KRW doel(en) u nastreeft in uw projectgebied en/of welke habitattypen er voorkomen. Vul alleen blauwe velden in. Witte velden worden niet meegenomen."]
[null,null,"Kwaliteitselement vis wordt niet meegenomen in dit afwegingskader."]
[null,null,"Welke KRW-doeltypen komen in het projectgebied voor?",null,null,null,null,null,null,"Welk KRW-doeltype streeft u na?",null,"Wat is de EKR-score?"]
[null,null,"Verander de 0 in een 1 als het type in uw gebied voorkomt. \nHet afwegingskader staat toe om maximaal 5 KRW-doeltypen en 2 N2000 habitattypen tegelijk te toetsen.",null,null,null,null,null,null,"Geef per geselecteerd KRW-doeltype aan welk KRW-doeltype u voor ditzelfde water nastreeft. Dit kan hetzelfde of anders zijn.",null,"Geef per geselecteerd KRW-doeltype aan wat de EKR-score is."]
[]
[null,null,"KRW-doeltypen nu",null,null,null,null,null,null,"KRW-doeltype dat wordt nagestreefd",null,"EKR score"]
[null,null,"M01a: Gebufferde sloten op zand of klei (zwak brak)",null,null,null,null,0,null,null,null,null,null,null,null,{"$f":"IF(H12=1,C12,\"\")","v":""},null,"Legenda"]
[null,null,"M01b: Niet zoete, gebufferde sloten op zand of klei",null,null,null,null,0,null,null,null,null,null,null,null,{"$f":"IF(H13=1,C13,\"\")","v":""}]
[null,null,"M03: Gebufferde (regionale) kanalen",null,null,null,null,0,null,null,null,null,null,null,null,"",null,null,null,"Een invulveld waar nog geen waarde is ingevuld*"]
[null,null,"M06: Grote ondiepe kanalen",null,null,null,null,0,null,null,null,null,null,null,null,"",null,null,null,"Een invulveld waar een correcte waarde is ingevuld"]
[null,null,"M07: Grote diepe kanalen",null,null,null,null,0,null,null,null,null,null,null,null,"",null,null,null,"Een veld dat voor u is ingevuld o.b.v. gegevens op een ander tabblad"]
[null,null,"M08: Gebufferde laagveensloten",null,null,null,null,0,null,null,null,null,null,null,null,{"$f":"IF(H17=1,C17,\"\")","v":""},null,null,null,"Een veld dat een invulveld kan worden o.b.v. invoerkeuzes"]
[null,null,"M10: laagveenvaarten en – kanalen",null,null,null,null,0,null,null,null,null,null,null,null,"",null,null,null,"*als de cel geen dropdownlijst bevat, dan dient u zelf een antwoord in te vullen."]
[null,null,"M11: Kleine ondiepe gebufferde plassen",null,null,null,null,0,null,null,null,null,null,null,null,""]
[null,null,"M14: Ondiepe gebufferde plassen",null,null,null,null,0,null,null,null,null,null,null,null,""]
[null,null,"M15: Ondiepe grote gebufferde meren",null,null,null,null,0,null,null,null,null,null,null,null,""]
[null,null,"M20: Matig grote diepe gebufferde meren",null,null,null,null,0,null,null,null,null,null,null,null,""]
[null,null,"M21: Grote diepe gebufferde meren",null,null,null,null,0,null,null,null,null,null,null,null,"",null,null,null,null,null,null,null,null,null,null,null,null,null,0]
[null,null,"M22: Kleine ondiepe kalkrijke plassen",null,null,null,null,0,null,null,null,null,null,null,null,"",null,null,null,null,null,null,null,null,null,null,null,null,null,1]
[null,null,"M23: Grote ondiepe kalkrijke plassen",null,null,null,null,0,null,null,null,null,null,null,null,""]
[null,null,"M25: Ondiepe laagveenplassen",null,null,null,null,0,null,null,null,null,null,null,null,""]
[null,null,"M27: Matig grote ondiepe laagveenplassen",null,null,null,null,0,null,null,null,null,null,null,null,""]
[null,null,"M29: Matig grote diepe laagveenmeren",null,null,null,null,0,null,null,null,null,null,null,null,""]
[null,null,"M30: Zwak brakke wateren",null,null,null,null,0,null,null,null,null,null,null,null,""]
[null,null,"M31 Kleine brakke tot zoute wateren",null,null,null,null,0,null,null,null,null,null,null,null,""]
[null,null,"M32 Grote brakke tot zoute meren ",null,null,null,null,0,null,null,null,null,null,null,null,""]
[null,null,{"$f":"IF(SUM(H12:H31)>5,\"U heeft meer KRW-doeltypen geselecteerd dan in dit afwegingskader parallel behandeld kunnen worden!\",\"\")","v":""}]
[]
[null,null,"N2000 habitattypen"]
[null,null,"H3150: Meren met Krabbescheer en fonteinkruiden",null,null,null,null,0]
[null,null,"H3140: Kranswierwateren (in zoete wateren)",null,null,null,null,0]
[]
[]
[]
[]
[null,null,"Waterbodem eigenschappen",null,null,null,null,null,null,null,null,null,null,null,null,{"$f":"SUM(H12:H31)","v":0}]
[]
[null,null,"In dit blok worden verdiepende vragen gesteld over de waterbodem. "]
[]
[null,null,{"$f":"IF(bodemtype<>\"\",\"Het meest voorkomende bodemtype dat u heeft ingevuld, is \",\"Maak eerst een keuze van het bodemtype op tabblad 1. Algemeen.\")","v":"Maak eerst een keuze van het bodemtype op tabblad 1. Algemeen."},null,null,null,null,null,null,{"$f":"IF(bodemtype<>\"\",bodemtype,\"nog niet geselecteerd (zie tabblad 1. Algemeen)\")","v":"nog niet geselecteerd (zie tabblad 1. Algemeen)"}]
[null,null,{"$f":"IF(bodemtype<>\"\",\"Is dit bodemtype van toepassing op alle geselecteerde typen?\",\"\")","v":""}]
[]
[null,null,"Specificeer het bodemtype van de geselecteerde KRW-doeltypen"]
[null,null,{"$f":"IF(SUM(H12:H31)=0,\"… kies eerst in het bovenste blok een KRW-doeltype en/of habitattype… \",IF(SUM(H12:H31)<6,_xlfn._xlws.FILTER(P12:P31,P12:P31<>\"\"),\"… teveel KRW-doeltypen geselecteerd …\"))","v":"… kies eerst in het bovenste blok een KRW-doeltype en/of habitattype… "},null,null,null,null,null,null,null,null,null,null,null,null,{"$f":"IF(AND(C49<>\"\",bool_KRW_bodemtype=\"Nee\"),1,0)","v":0}]
[null,null,null,null,null,null,null,null,null,null,null,null,null,null,null,0]
[null,null,null,null,null,null,null,null,null,null,null,null,null,null,null,0]
[null,null,null,null,null,null,null,null,null,null,null,null,null,null,null,0]
[null,null,null,null,null,null,null,null,null,null,null,null,null,null,null,0]
[null,null,{"$f":"_xlfn._xlws.FILTER(C35:C36,H35:H36=1,\"\")","v":""},null,null,null,null,null,null,null,null,null,null,null,null,0]
[null,null,null,null,null,null,null,null,null,null,null,null,null,null,null,0]
[null,null,null,null,null,null,null,null,null,null,null,null,null,null,null,1]
[null,null,"Is er sprake van een organische sliblaag?",null,null,null,null,null,null,null,null,null,null,null,null,1]
[null,null,"Een organische sliblaag maakt dat de bodem wordt behandeld als 'veen'.",null,null,null,null,null,null,null,null,null,null,null,null,1]
[null,null,{"$f":"IF(SUM(H12:H31)=0,\"… kies eerst in het bovenste blok een KRW-doeltype en/of habitattype… \",IF(SUM(H12:H31)<6,_xlfn._xlws.FILTER(P12:P31,P12:P31<>\"\"),\"… teveel KRW-doeltypen geselecteerd …\"))","v":"… kies eerst in het bovenste blok een KRW-doeltype en/of habitattype… "},null,null,null,null,null,null,null,null,null,null,null,null,{"$f":"IF(SUM(H12:H36)=0,1,IF(AND(SUM(H12:H31)=0,SUM(H35:H36)>0),0,1))","v":1}]
[null,null,null,null,null,null,null,null,null,null,null,null,null,null,null,{"$f":"IF(C60<>\"\",1,0)","v":0}]
[null,null,null,null,null,null,null,null,null,null,null,null,null,null,null,0]
[null,null,null,null,null,null,null,null,null,null,null,null,null,null,null,0]
[null,null,null,null,null,null,null,null,null,null,null,null,null,null,null,0]
[null,null,{"$f":"_xlfn._xlws.FILTER(C35:C36,H35:H36=1,\"\")","v":""},null,null,null,null,null,null,null,null,null,null,null,null,0]
[null,null,null,null,null,null,null,null,null,null,null,null,null,null,null,0]
[]
[]
[]
[]
[null,null,"Zoutsituatie (HUIDIG)",null,null,null,null,null,null,null,null,null,"Hulptabel: Zoutsituatie (huidige Cl gehalte) voor KRW doeltypen en N2000 beheertypen"]
[]
[null,null,"In dit blok worden verdiepende vragen gesteld over de HUIDIGE zoutsituatie. Maak bij het gebruikersoordeel gebruik van de hiernaast staande tabel.",null,null,null,null,null,null,null,null,null,"Hieronder staat per KRW en N2000 type wat het gewenste bereik is van zoutsituaties (kolom Huidige Cl gehalte)."]
[]
[null,null,"Welke huidige zoutsituatie hoort bij de geselecteerde KRW-doeltypen en N2000 habitattypen?"]
[null,null,"Ga hierbij uit van een gemiddeld jaar, nog zonder de te toetsen verstoring (verzilting of verzoeting). Zie tabel hiernaast voor de gangbare indeling. "]
[null,null,"Het kan zijn dat de huidige zoutsituatie afwijkt van de in de tabel aangegeven indeling."]
[null,null,{"$f":"IF(SUM(H12:H31)=0,\"… kies eerst in het bovenste blok een KRW-doeltype en/of habitattype… \",IF(SUM(H12:H31)<6,_xlfn._xlws.FILTER(P12:P31,P12:P31<>\"\"),\"… teveel KRW-doeltypen geselecteerd …\"))","v":"… kies eerst in het bovenste blok een KRW-doeltype en/of habitattype… "},null,null,null,null,null,null,null,{"$f":"IFERROR(IF(J77=\"\",\"\",IF(AND('3. KRW'!O77>=_xlfn.XLOOKUP(C77,Invoer!$B$34:$B$55,Invoer!$D$34:$D$55),'3. KRW'!O77<=_xlfn.XLOOKUP(C77,Invoer!$B$34:$B$55,Invoer!$E$34:$E$55)),\"\",\"X\")),\"\")","v":""},null,null,null,{"$f":"_xlfn.XLOOKUP(J77,Invoer!$I$34:$I$39,Invoer!$J$34:$J$39,0)","v":0},{"$f":"IF(SUM(H12:H36)=0,1,IF(AND(SUM(H12:H31)=0,SUM(H35:H36)>0),0,1))","v":1}]
[null,null,null,null,null,null,null,null,null,null,{"$f":"IF(J78=\"\",\"\",IF(AND('3. KRW'!O78>=_xlfn.XLOOKUP(C78,Invoer!$B$34:$B$55,Invoer!$D$34:$D$55),'3. KRW'!O78<=_xlfn.XLOOKUP(C78,Invoer!$B$34:$B$55,Invoer!$E$34:$E$55)),\"\",\"X\"))","v":""},null,null,null,{"$f":"_xlfn.XLOOKUP(J78,Invoer!$I$34:$I$39,Invoer!$J$34:$J$39,0)","v":0},{"$f":"IF(C78<>\"\",1,0)","v":0}]
[null,null,null,null,null,null,null,null,null,null,{"$f":"IF(J79=\"\",\"\",IF(AND('3. KRW'!O79>=_xlfn.XLOOKUP(C79,Invoer!$B$34:$B$55,Invoer!$D$34:$D$55),'3. KRW'!O79<=_xlfn.XLOOKUP(C79,Invoer!$B$34:$B$55,Invoer!$E$34:$E$55)),\"\",\"X\"))","v":""},null,null,null,{"$f":"_xlfn.XLOOKUP(J79,Invoer!$I$34:$I$39,Invoer!$J$34:$J$39,0)","v":0},0]
[null,null,null,null,null,null,null,null,null,null,{"$f":"IF(J80=\"\",\"\",IF(AND('3. KRW'!O80>=_xlfn.XLOOKUP(C80,Invoer!$B$34:$B$55,Invoer!$D$34:$D$55),'3. KRW'!O80<=_xlfn.XLOOKUP(C80,Invoer!$B$34:$B$55,Invoer!$E$34:$E$55)),\"\",\"X\"))","v":""},null,null,null,{"$f":"_xlfn.XLOOKUP(J80,Invoer!$I$34:$I$39,Invoer!$J$34:$J$39,0)","v":0},0]
[null,null,null,null,null,null,null,null,null,null,{"$f":"IF(J81=\"\",\"\",IF(AND('3. KRW'!O81>=_xlfn.XLOOKUP(C81,Invoer!$B$34:$B$55,Invoer!$D$34:$D$55),'3. KRW'!O81<=_xlfn.XLOOKUP(C81,Invoer!$B$34:$B$55,Invoer!$E$34:$E$55)),\"\",\"X\"))","v":""},null,null,null,{"$f":"_xlfn.XLOOKUP(J81,Invoer!$I$34:$I$39,Invoer!$J$34:$J$39,0)","v":0},0]
[null,null,null,null,null,null,null,null,null,null,{"$f":"IF(J82=\"\",\"\",IF(AND('3. KRW'!O82>=_xlfn.XLOOKUP(C82,Invoer!$B$34:$B$55,Invoer!$D$34:$D$55),'3. KRW'!O82<=_xlfn.XLOOKUP(C82,Invoer!$B$34:$B$55,Invoer!$E$34:$E$55)),\"\",\"X\"))","v":""},null,null,null,{"$f":"_xlfn.XLOOKUP(J82,Invoer!$I$34:$I$39,Invoer!$J$34:$J$39,0)","v":0},0]
[null,null,{"$f":"_xlfn._xlws.FILTER(C35:C36,H35:H36=1,\"\")","v":""},null,null,null,null,null,null,null,{"$f":"IF(J83=\"\",\"\",IF(AND('3. KRW'!O83>=_xlfn.XLOOKUP(C83,Invoer!$B$34:$B$55,Invoer!$D$34:$D$55),'3. KRW'!O83<=_xlfn.XLOOKUP(C83,Invoer!$B$34:$B$55,Invoer!$E$34:$E$55)),\"\",\"X\"))","v":""},null,null,null,{"$f":"_xlfn.XLOOKUP(J83,Invoer!$I$34:$I$39,Invoer!$J$34:$J$39,0)","v":0},0]
[null,null,null,null,null,null,null,null,null,null,{"$f":"IF(J84=\"\",\"\",IF(AND('3. KRW'!O84>=_xlfn.XLOOKUP(C84,Invoer!$B$34:$B$55,Invoer!$D$34:$D$55),'3. KRW'!O84<=_xlfn.XLOOKUP(C84,Invoer!$B$34:$B$55,Invoer!$E$34:$E$55)),\"\",\"X\"))","v":""},null,null,null,{"$f":"_xlfn.XLOOKUP(J84,Invoer!$I$34:$I$39,Invoer!$J$34:$J$39,0)","v":0},0]
[null,null,{"$f":"IF(SUMPRODUCT(--(K77:K84=\"X\"))>0, \"X: De ingevoerde huidige zoutsituatie past niet bij dit KRW of N2000 type. Weet u dit zeker?\", \"\")","v":""}]
[]
[]
[]
[null,null,"Maatregelen t.b.v. waterkwaliteit (anders dan zout)"]
[]
[null,null,"In dit blok wordt gevraagd of er nog andere maatregelen worden genomen die van invloed zijn op de ecologische waterkwaliteit."]
[]
[null,null,"Worden er thans maatregelen genomen om de waterkwaliteit (op andere vlakken dan zoutgehalte) te verbeteren?"]
[]
[]
[null,null,"Welke maatregelen worden thans genomen?"]

{"sheet":"4. Terrestrisch","index":4,"n_rows":75,"n_cols":28,"rows_kept":75,"cut":false,"hidden":false,"merged":[[37,2,38,4],[74,3,74,4],[69,3,69,4],[70,3,70,4],[71,3,71,4],[72,3,72,4],[73,3,73,4],[65,2,66,8]]}
[]
[]
[]
[null,null,"NNN beheertypen",null,null,null,null,null,"N2000 habitattypen",null,null,null,null,null,null,null,"Legenda"]
[]
[null,null,"In dit blok kunt u aangeven welke NNN beheertypen in uw gebied voorkomen.",null,null,null,null,null,"In dit blok kunt u aangeven welke habitattypen in uw gebied voorkomen en wat de huidige staat van kwaliteit hiervan is."]
[]
[null,null,"Welke NNN beheertypen komen in het projectgebied voor?",null,null,null,null,null,"Welke N2000 habitattypen komen in het projectgebied voor?",null,null,null,"Wat is de huidige staat van kwaliteit van de geselecteerde habitattypen?",null,null,null,null,null,"Een invulveld waar nog geen waarde is ingevuld"]
[null,null,"Verander de 0 in een 1 als het type in uw gebied voorkomt.",null,null,null,null,null,"Verander de 0 in een 1 als het type in uw gebied voorkomt.",null,null,null,"Maak gebruik van de drop-down lijst om een keuze te maken. ",null,null,null,null,null,"Een invulveld waar een correcte waarde is ingevuld"]
[null,null,{"$f":"Invoer!B61","v":"N01.03-Rivier- en moeraslandschap"},null,0,null,null,null,"H1320 - Slijkgrasvelden",null,0]
[null,null,{"$f":"Invoer!B62","v":"N05.02-Gemaaid rietland"},null,0,null,null,null,"H1330_B - Schorren en zilte graslanden (binnendijks)",null,0]
[null,null,{"$f":"Invoer!B63","v":"N05.03-Veenmoeras"},null,0,null,null,null,"H2140_A - Duinheiden met kraaihei (vochtig)",null,0]
[null,null,{"$f":"Invoer!B64","v":"N05.04-Dynamisch Moeras"},null,0,null,null,null,"H2180_B - Duinbossen (vochtig)",null,0]
[null,null,{"$f":"Invoer!B65","v":"N06.01-Veenmosrietland en moerasheide"},null,0,null,null,null,"H2180_C - Duinbossen (binnenduinrand)",null,0]
[null,null,{"$f":"Invoer!B66","v":"N06.02-Trilveen"},null,0,null,null,null,"H2190_B - Vochtige duinvalleien (kalkrijk)",null,0]
[null,null,{"$f":"Invoer!B67","v":"N06.04-Vochtige heide"},null,0,null,null,null,"H2190_C - Vochtige duinvalleien (ontkalkt)",null,0,null,null,null,null,null,null,null,null,null,null,null,null,null,null,null,null,0]
[null,null,{"$f":"Invoer!B68","v":"N08.01-Strand en embryonaal duin"},null,0,null,null,null,"H2190_D - Vochtige duinvalleien (hoge moerasplanten)",null,0,null,null,null,null,null,null,null,null,null,null,null,null,null,null,null,null,1]
[null,null,{"$f":"Invoer!B69","v":"N10.01-Nat schraalland"},null,0,null,null,null,"H4010_B - Vochtige heiden (laagveengebied)",null,0]
[null,null,{"$f":"Invoer!B70","v":"N10.02-Vochtig hooiland"},null,0,null,null,null,"H6120 - Stroomdalgraslanden",null,0]
[null,null,{"$f":"Invoer!B71","v":"N12.01-Bloemdijk"},null,0,null,null,null,"H6230 - Heischrale graslanden",null,0]
[null,null,{"$f":"Invoer!B72","v":"N12.02-Kruiden- en faunarijk grasland"},null,0,null,null,null,"H6410 - Blauwgraslanden",null,0]
[null,null,{"$f":"Invoer!B73","v":"N12.03-Glanshaverhooiland"},null,0,null,null,null,"H6430_A - Ruigten en zomen (moerasspirea)",null,0]
[null,null,{"$f":"Invoer!B74","v":"N12.04-Zilt- en overstromingsgrasland"},null,0,null,null,null,"H6430_B - Ruigten en zomen (harig wilgenroosje)",null,0]
[null,null,{"$f":"Invoer!B75","v":"N12.05-Kruiden- en faunarijke akker"},null,0,null,null,null,"H6510_A - Glanshaver- en vossenstaarthooilanden (glanshaver)",null,0]
[null,null,{"$f":"Invoer!B76","v":"N12.06-Ruigteveld"},null,0,null,null,null,"H6510_B - Glanshaver- en vossenstaarthooilanden (grote vossenstaart)",null,0]
[null,null,{"$f":"Invoer!B77","v":"N13.01-Vochtig weidevogelgrasland"},null,0,null,null,null,"H7140_A - Overgangs- en trilvenen (trilvenen)",null,0]
[null,null,{"$f":"Invoer!B78","v":"N13.02-Wintergastenweide"},null,0,null,null,null,"H7140_B - Overgangs- en trilvenen (veenmosrietlanden)",null,0]
[null,null,{"$f":"Invoer!B79","v":"N14.01-Rivier- en beekbegeleidend bos"},null,0,null,null,null,"H7150 - Pioniervegetaties met snavelbiezen",null,0]
[null,null,{"$f":"Invoer!B80","v":"N14.02-Hoog- en laagveenbos"},null,0,null,null,null,"H7210 - Galigaanmoerassen",null,0]
[null,null,{"$f":"Invoer!B81","v":"N14.03-Haagbeuken- en essenbos"},null,0,null,null,null,"H7230 - Kalkmoerassen",null,0]
[null,null,{"$f":"Invoer!B82","v":"N15.01-Duinbos"},null,0,null,null,null,"H91D0 - Hoogveenbossen",null,0]
[null,null,{"$f":"Invoer!B83","v":"N15.02-Dennen-, eiken-, en beukenbos"},null,0,null,null,null,"H91E0_A - Vochtige alluviale bossen (zachthoutooibossen)",null,0]
[null,null,{"$f":"Invoer!B84","v":"N16.04-Vochtig bos met productie"},null,0,null,null,null,"H91E0_B - Vochtige alluviale bossen (essen-iepenbossen)",null,0]
[null,null,{"$f":"Invoer!B85","v":"N17.03-Park- en stinzenbos"},null,0,null,null,null,"H91E0_C - Vochtige alluviale bossen (beekbegeleidende bossen)",null,0]
[null,null,{"$f":"Invoer!B86","v":"N17.04-Eendenkooi"},null,0,null,null,null,{"$f":"IF(SUM(K12:K34)>5,\"U kunt maar maximaal 5 zoete habitattypen per keer testen. Wilt u er meer testen? Vul dan het afwegingskader nog een keer in voor de resterende typen.\",\"\")","v":""}]
[null,null,{"$f":"Invoer!B87","v":"N17.05-Wilgengriend"},null,0]
[null,null,{"$f":"Invoer!B88","v":"N17.06-Vochtig en hellinghakhout"},null,0]
[null,null,{"$f":"IF(SUM(E10:E37)>5,\"U kunt maar maximaal 5 beheertypen per keer testen. Wilt u er meer testen? Vul dan het afwegingskader nog een keer in voor de resterende typen.\",\"\")","v":""}]
[]
[]
[]
[null,null,"Omgevingsparameters"]
[]
[null,null,"Het totale risico voor verzilting (en verzoeting) wordt mede bepaald door de gevoeligheid van het abiotische systeem. Hierbij spelen factoren die de gevoeligheid bepalen:"]
[null,null,"-       Werking van het watersysteem:"]
[null,null,"·        Verblijftijd als mate van isolatie van een waterlichaam;"]
[null,null,"·        Aanwezigheid van brakke kwel;"]
[null,null,"-       Hoe gemakkelijk kan zout of zoet water de wortelzone bereiken"]
[null,null,"·        Dichtheid sloten / land-water contact;"]
[null,null,"·        Bodemweerstand"]
[null,null,"·        Noodzaak voor bevloeiing "]
[]
[null,null,"Kan brakke kwel optreden (gebruikersoordeel)?"]
[null,null,"  N.B. Kan brakke kwel optreden onder normale omstandigheden en/of tijdens een lager peil (bijv. door droogte of peilbeheer)"]
[null,null,"Is de dichtheid van de sloten hoog of laag (gebruikersoordeel)?"]
[null,null,"  N.B. hoog is voor (overgeërfde) veengebieden, laag is voor anderssoortige gebieden"]
[null,null,"Wordt er nu of in de toekomst bevloeid (gebruikersoordeel)?"]
[null,null,"  N.B. deze vraag is alleen relevant voor N10.01, N12.04, H6410 en H1330_B"]
[]
[]
[]
[null,null,{"$f":"IF(bool_toets_verstoring=\"Ja - verstoring\",\"Te testen verstoring\", IF(bool_toets_verstoring=\"Ja - fysieke ingreep\",\"Te testen fysieke ingreep\",\"Te testen verstoring of fysieke ingreep\"))","v":"Te testen verstoring of fysieke ingreep"}]
[]
[null,null,{"$f":"IF(bool_toets_verstoring=\"Ja - verstoring\",\"Op tabblad 1. Algemeen heeft u aangegeven dat u wilt toetsen op een verstoring. Daarom worden er hier verdere vragen gesteld.\", IF(bool_toets_verstoring=\"Ja - fysieke ingreep\", \"Op tabblad 1. Algemeen heeft u aangegeven dat u wilt toetsen op een fysieke ingreep. Er zijn hier geen verdere vragen.\",\"Op tabblad 1. Algemeen heeft u (nog) niet aangegeven dat u wilt toetsen op een verstoring. Er worden hier daarom geen verdere vragen gesteld.\"))","v":"Op tabblad 1. Algemeen heeft u (nog) niet aangegeven dat u wilt toetsen op een verstoring. Er worden hier daarom geen verdere vragen gesteld."}]
[null,null,null,null,null,null,null,null,null,null,null,null,null,null,null,null,null,null,null,null,null,null,null,null,null,null,{"$f":"IF(bool_toets_verstoring=\"Ja - verstoring\",1,0)","v":0}]
[null,null,"Er is nog geen vaste beslisregel te geven voor dit onderdeel omdat de risicobeoordeling van een verzilting of verzoeting te systeem-afhankelijk is en er nog geen duidelijke grenswaarden zijn. Het is aan de gebruiker om voor de volgende deelaspecten van de verstoring zelf een inschatting te maken welk oordeel passend is.",null,null,null,null,null,null,null,null,null,null,null,null,null,null,null,null,null,null,null,null,null,null,null,0]
[null,null,null,null,null,null,null,null,null,null,null,null,null,null,null,null,null,null,null,null,null,null,null,null,null,null,0]
[null,null,"  N.B. Waardes van tabblad 1. Algemeen zijn hieronder aangevuld tussen de haakjes.",null,null,null,null,null,null,null,null,null,null,null,null,null,null,null,null,null,null,null,null,null,null,null,0]
[null,null,"   Ziet u hieronder nog geen getallen staan tussen de haakjes, vul deze dan eerst in op tabblad 1. Algemeen.",null,null,null,null,null,null,null,null,null,null,null,null,null,null,null,null,null,null,null,null,null,null,null,0]
[null,null,{"$f":"_xlfn.CONCAT(\"Gemiddelde duur (\", verstoring_duur,\" dagen)\")","v":"Gemiddelde duur ( dagen)"},null,null,null,null,null,null,null,null,null,null,null,null,null,null,null,null,null,null,null,null,null,null,null,0]
[null,null,{"$f":"_xlfn.CONCAT(\"Frequentie (\", verstoring_frequentie,\" keer per jaar)\")","v":"Frequentie ( keer per jaar)"},null,null,null,null,null,null,null,null,null,null,null,null,null,null,null,null,null,null,null,null,null,null,null,0]
[null,null,{"$f":"_xlfn.CONCAT(\"Tijdsinterval (\", verstoring_tijdsinterval,\" dagen tussen opeenvolgende verstoringen)\")","v":"Tijdsinterval ( dagen tussen opeenvolgende verstoringen)"},null,null,null,null,null,null,null,null,null,null,null,null,null,null,null,null,null,null,null,null,null,null,null,0]
[null,null,{"$f":"_xlfn.CONCAT(\"Moment (\", verstoring_moment,\")\")","v":"Moment ()"},null,null,null,null,null,null,null,null,null,null,null,null,null,null,null,null,null,null,null,null,null,null,null,0]
[null,null,{"$f":"IF(eenheid_zoutgehalte_algemeen=\"Chloridegehalte\",_xlfn.CONCAT(\"Concentratie (\",verstoring_zoutgehalte,\" mg Cl/l)\"),\nIF(eenheid_zoutgehalte_algemeen=\"EC-waarde\",_xlfn.CONCAT(\"Concentratie (\", verstoring_zoutgehalte,\" dS/m)\"),\"Eenheid zoutconcentratie onbekend\"))","v":"Eenheid zoutconcentratie onbekend"},null,null,null,null,null,null,null,null,null,null,null,null,null,null,null,null,null,null,null,null,null,null,null,0]
[null,null,{"$f":"_xlfn.CONCAT(\"Omvang (\", verstoring_omvang_ha,\" ha / \", verstoring_omvang_perc, \" %)\")","v":"Omvang ( ha /  %)"},null,null,null,null,null,null,null,null,null,null,null,null,null,null,null,null,null,null,null,null,null,null,null,0]

{"sheet":"5. Overig","index":5,"n_rows":16,"n_cols":5,"rows_kept":16,"cut":false,"hidden":false,"merged":[[4,12,4,15]]}
[]
[]
[null,null,"Overig"]
[]
[null,null,"Zijn er nog andere facetten die mogelijk last kunnen hebben van de verstoring of fysieke ingreep?"]
[]
[]
[]
[]
[]
[null,null,"Legenda"]
[]
[null,null,null,null,"Een invulveld waar nog geen waarde is ingevuld*"]
[null,null,null,null,"Een invulveld waar een correcte waarde is ingevuld"]
[]
[null,null,null,null,"*als de cel geen dropdownlijst bevat, dan dient u zelf een antwoord in te vullen."]

{"sheet":"6. Dashboard Risico's","index":6,"n_rows":280,"n_cols":23,"rows_kept":280,"cut":false,"hidden":false,"merged":[[74,3,74,9],[75,3,75,9],[154,3,154,7],[155,3,155,7],[146,3,146,7],[147,3,147,7],[148,3,148,7],[149,3,149,7],[150,3,150,7],[125,3,125,7],[126,3,126,7],[124,3,124,7],[136,3,136,11],[138,3,138,11],[139,3,139,11],[140,3,140,11],[131,3,131,11],[132,3,132,11],[133,3,133,11],[134,3,134,11],[135,3,135,11],[69,3,69,7],[70,3,70,7],[80,3,80,7],[107,3,107,7],[117,3,117,7],[8,2,8,11],[151,3,151,7],[153,3,153,7],[119,3,119,7],[120,3,120,7],[121,3,121,7],[122,3,122,7],[93,3,93,7],[94,3,94,7],[95,3,95,7],[96,3,96,7],[97,3,97,7],[118,3,118,7],[98,3,98,7],[99,3,99,7],[100,3,100,7],[101,3,101,7],[102,3,102,7],[103,3,103,7],[259,3,259,7],[260,3,260,7],[170,3,170,11],[172,3,172,11],[173,3,173,11],[174,3,174,11],[171,3,171,11],[247,3,247,7],[248,3,248,7],[249,3,249,7],[250,3,250,7],[230,3,230,7],[231,3,231,7],[233,3,233,7],[234,3,234,7],[235,3,235,7],[226,3,226,7],[227,3,227,7],[228,3,228,7],[229,3,229,7],[261,3,261,7],[262,3,262,7],[263,3,263,7],[252,3,252,7],[254,3,254,7],[255,3,255,7],[256,3,256,7],[258,3,258,7],[165,3,165,11],[166,3,166,11],[167,3,167,11],[168,3,168,11],[169,3,169,11],[191,3,191,11],[177,3,177,11],[178,3,178,11],[179,3,179,11],[251,3,251,7],[242,3,242,7],[237,3,237,7],[238,3,238,7],[239,3,239,7],[240,3,240,7],[241,3,241,7],[174,18,174,22],[175,18,175,22],[176,18,176,22],[190,3,190,11],[187,3,187,11],[188,3,188,11],[189,3,189,11],[165,18,165,22],[166,18,166,22],[167,18,167,22],[168,18,168,22],[169,18,169,22],[170,18,170,22],[171,18,171,22],[172,18,172,22],[173,18,173,22],[185,3,185,11],[180,3,180,11],[181,3,181,11],[182,3,182,11],[183,3,183,11],[184,3,184,11],[175,3,175,11],[176,3,176,11],[56,0,281,0],[56,15,281,15],[193,18,193,22],[194,18,194,22],[195,18,195,22],[188,18,188,22],[189,18,189,22],[190,18,190,22],[191,18,191,22],[192,18,192,22],[182,18,182,22],[183,18,183,22],[184,18,184,22],[185,18,185,22],[187,18,187,22],[177,18,177,22],[178,18,178,22],[179,18,179,22],[180,18,180,22],[181,18,181,22],[192,3,192,11],[193,3,193,11],[194,3,194,11],[195,3,195,11]]}
[null,null,null,null,null,null,null,null,null,null,null,null,null,null,1]
[null,null,"DASHBOARD",null,null,null,null,null,null,null,null,null,null,null,1]
[null,null,null,null,null,null,null,null,null,null,null,null,null,null,1]
[null,null,"In dit dashboard wordt een samenvatting gepresenteerd van de verwachte risco's voor de functies die zijn gekozen op tabblad 1. Algemeen.",null,null,null,null,null,null,null,null,null,null,null,1]
[null,null,"Eerst volgt een overzicht van de algemene gegevens, gevolgd door de risico's in de huidige situatie (linkerblok) en de toekomstige situatie (rechterblok), wanneer",null,null,null,null,null,null,null,null,null,null,null,1]
[null,null,"u toetst op een verstoring (verzilting of verzoeting) of op de gevolgen van een fysieke ingreep (bijv.: het plaatsen van damwanden om brakke kwel te verminderen).",null,null,null,null,null,null,null,null,null,null,null,1]
[null,null,"U kunt dit overzicht gebruiken als onderbouwing voor het maken van een gebruikersoordeel hoe te handelen met zoet-zout dynamiek in uw projectgebied.",null,null,null,null,null,null,null,null,null,null,null,1]
[null,null,null,null,null,null,null,null,null,null,null,null,null,null,1]
[null,null,"Het afwegingskader berust op de laatste kennis omtrent de hydrologische, biogeochemische en biologische processen die een effect uitoefenen op de aquatische natuur, terrestrische natuur en landbouw. Op basis van deze kennis is getracht te komen tot grenswaarden (m.b.v. deskundigenoordelen van The Salt Doctors, Van Geest Ecologie en Witteveen+Bos). Een belangrijke kanttekening is dat deze grenswaarden maar zo gedetailleerd kunnen zijn als de huidige kennis toe staat. Hierbij is ervoor gekozen om aan de voorzichtige kant te zitten en risico's sneller als hoger in te schatten."]
[]
[null,null,"N.B. 1 Wilt u voor een bepaald risico meer inzicht hebben dan het dashboard verschaft, bijvoorbeeld om beter te begrijpen hoe een risico tot stand is gekomen? ",null,null,null,null,null,null,null,null,null,null,null,1]
[null,null,"Ga dan naar de bijbehorende risicolegger (paarse tabbladen).",null,null,null,null,null,null,null,null,null,null,null,1]
[null,null,null,null,null,null,null,null,null,null,null,null,null,null,1]
[null,null,"N.B. 2 Ziet u geen gegevens staan of alleen de term 'niet opgegeven', dan missen er nog gegevens. Vul deze in op de tabbladen 1 t/m 5.",null,null,null,null,null,null,null,null,null,null,null,1]
[null,null,null,null,null,null,null,null,null,null,null,null,null,null,1]
[null,null,"N.B. 3 Alleen voor de functies die u op tabblad 1. Algemeen hebt aangevinkt, verschaft dit dashboard inzicht. Dit overzicht vindt u terug onderaan 'Algemene gegevens' op deze pagina."]
[]
[null,null,"Algemene gegevens",null,null,null,null,null,null,null,null,null,null,null,1]
[null,null,null,null,null,null,null,null,null,null,null,null,null,null,1]
[null,null,"Hier volgt een korte opsomming van enkele algemene gegevens over het projectgebied. Voor functie-specifieke gegevens kunt u terecht in de bijbehorende groene tabbladen 2 t/m 5.",null,null,null,null,null,null,null,null,null,null,null,1]
[null,null,null,null,null,null,null,null,null,null,null,null,null,null,1]
[null,null,"Schaalniveau projectgebied:",null,null,null,null,{"$f":"IF('1. Algemeen'!K5<>\"\",'1. Algemeen'!K5,\"niet opgegeven\")","v":"niet opgegeven"},null,null,null,null,null,null,1]
[null,null,"Ontstaansgeschiedenis:",null,null,null,null,null,null,null,null,null,null,null,1]
[null,null,"Bodemtype:",null,null,null,null,{"$f":"IF(bodemtype<>\"\",bodemtype,\"niet opgegeven\")","v":"niet opgegeven"},null,null,null,null,null,null,1]
[null,null,"Bodemlaag gevormd onder omstandigheden:",null,null,null,null,{"$f":"IF('1. Algemeen'!K21<>\"\",'1. Algemeen'!K21,\"niet opgegeven\")","v":"niet opgegeven"},null,null,null,null,null,null,1]
[null,null,"Oppervlaktewater nu overheersend:",null,null,null,null,{"$f":"IF(heersend_milieu<>\"\",heersend_milieu,\"niet opgegeven\")","v":"niet opgegeven"},null,null,null,null,null,null,1]
[null,null,null,null,null,null,null,null,null,null,null,null,null,null,1]
[null,null,"Huidig waterbeheer:",null,null,null,null,null,null,null,null,null,null,null,1]
[null,null,"Aanvoer van water hoofdzakelijk geregeld als:",null,null,null,null,{"$f":"IF(aanvoer_watersysteem<>\"\",aanvoer_watersysteem,\"niet opgegeven\")","v":"niet opgegeven"},null,null,null,null,null,null,1]
[null,null,"Verblijftijd:",null,null,null,null,{"$f":"IF(verblijftijd<>\"\",verblijftijd,\"niet opgegeven\")","v":"niet opgegeven"},null,null,null,null,null,null,1]
[null,null,"Leidend peilbeheer:",null,null,null,null,{"$f":"IF(leidend_peilbeheer<>\"\",leidend_peilbeheer,\"niet opgegeven\")","v":"niet opgegeven"},null,null,null,null,null,null,1]
[null,null,"Redenen om water in te laten:",null,null,null,null,{"$f":"IF(toets_inlaatwater=\"Ja\",IF(redenen_inlaten_wel<>\"\",redenen_inlaten_wel,\"niet opgegeven\"),IF(toets_inlaatwater=\"Nee\",\"U wordt aangeraden de STOWA toets 'inlaatwater vs gebiedsvreemdwater' te doorlopen voor aanvullend inzicht dat relevant kan zijn voor het maken van een afweging voor de zoet-zout dynamiek.\",\"n.v.t.\"))","v":"n.v.t."},null,null,null,null,null,null,1]
[null,null,"Redenen om water niet in te laten:",null,null,null,null,{"$f":"IF(toets_inlaatwater=\"Ja\",IF(redenen_inlaten_niet<>\"\",redenen_inlaten_niet,\"niet opgegeven\"),IF(toets_inlaatwater=\"Nee\",\"U wordt aangeraden de STOWA toets 'inlaatwater vs gebiedsvreemdwater' te doorlopen voor aanvullend inzicht dat relevant kan zijn voor het maken van een afweging voor de zoet-zout dynamiek.\",\"n.v.t.\"))","v":"n.v.t."},null,null,null,null,null,null,1]
[null,null,null,null,null,null,null,null,null,null,null,null,null,null,1]
[null,null,"Zoutsituatie huidig:",null,null,null,null,null,null,null,null,null,null,null,1,null,null,"Zoutsituatie toekomst:"]
[null,null,"Oppervlaktewater zoutgehalte (minimaal):",null,null,null,null,{"$f":"IF('1. Algemeen'!K45<>\"\",'1. Algemeen'!K45,\"niet opgegeven\")","v":"niet opgegeven"},{"$f":"IF(eenheid_zoutgehalte_algemeen=\"Chloridegehalte\",\"mg Cl/l\",IF(eenheid_zoutgehalte_algemeen=\"EC-waarde\",\"dS/m\",\"eenheid onbekend\"))","v":"eenheid onbekend"},null,null,null,null,null,1,null,null,"Oppervlaktewater zoutgehalte (maximaal):",null,null,{"$f":"IF(AND(OR(bool_toets_verstoring=\"Ja - verstoring\",bool_toets_verstoring=\"Ja - fysieke ingreep\"),maximaal_zoutgehalte_toekomst>0),maximaal_zoutgehalte_toekomst,\"niet opgegeven\")","v":"niet opgegeven"},{"$f":"IF(eenheid_zoutgehalte_algemeen=\"Chloridegehalte\",\"mg Cl/l\",IF(eenheid_zoutgehalte_algemeen=\"EC-waarde\",\"dS/m\",\"eenheid onbekend\"))","v":"eenheid onbekend"}]
[null,null,"Oppervlaktewater zoutgehalte (zomerhalfjaargemiddeld):",null,null,null,null,{"$f":"IF('1. Algemeen'!K46<>\"\",'1. Algemeen'!K46,\"niet opgegeven\")","v":"niet opgegeven"},{"$f":"IF(eenheid_zoutgehalte_algemeen=\"Chloridegehalte\",\"mg Cl/l\",IF(eenheid_zoutgehalte_algemeen=\"EC-waarde\",\"dS/m\",\"eenheid onbekend\"))","v":"eenheid onbekend"},null,null,null,null,null,1,null,null,"Irrigatiewater zoutgehalte (maximaal):",null,null,{"$f":"IF(AND(bool_opp_irrigatie=\"Nee\",OR(bool_toets_verstoring=\"Ja - verstoring\",bool_toets_verstoring=\"Ja - fysieke ingreep\")),maximaal_zoutgehalte_toekomst_irrigatie,\"niet opgegeven\")","v":"niet opgegeven"},{"$f":"IF(eenheid_zoutgehalte_landbouw_huidig=\"Chloridegehalte\",\"mg Cl/l\",IF(eenheid_zoutgehalte_landbouw_huidig=\"EC-waarde\",\"dS/m\",\"eenheid onbekend\"))","v":"eenheid onbekend"}]
[null,null,"Oppervlaktewater zoutgehalte (jaargemiddeld):",null,null,null,null,{"$f":"IF('1. Algemeen'!K47<>\"\",'1. Algemeen'!K47,\"niet opgegeven\")","v":"niet opgegeven"},{"$f":"IF(eenheid_zoutgehalte_algemeen=\"Chloridegehalte\",\"mg Cl/l\",IF(eenheid_zoutgehalte_algemeen=\"EC-waarde\",\"dS/m\",\"eenheid onbekend\"))","v":"eenheid onbekend"},null,null,null,null,null,1]
[null,null,"Oppervlaktewater zoutgehalte (maximaal):",null,null,null,null,{"$f":"IF('1. Algemeen'!K48<>\"\",'1. Algemeen'!K48,\"niet opgegeven\")","v":"niet opgegeven"},{"$f":"IF(eenheid_zoutgehalte_algemeen=\"Chloridegehalte\",\"mg Cl/l\",IF(eenheid_zoutgehalte_algemeen=\"EC-waarde\",\"dS/m\",\"eenheid onbekend\"))","v":"eenheid onbekend"},null,null,null,null,null,1]
[null,null,null,null,null,null,null,null,null,null,null,null,null,null,1]
[null,null,"Functies en doelen:",null,null,null,null,null,null,null,null,null,null,null,1]
[null,null,"U streeft de volgende functies na in het projectgebied:",null,null,null,null,null,null,null,null,null,null,null,1]
[null,null,{"$f":"_xlfn._xlws.FILTER('1. Algemeen'!C58:C62,'1. Algemeen'!F58:F62=TRUE,\"geen gekozen\")","v":"geen gekozen"},null,null,null,null,null,null,null,null,null,null,null,{"$f":"IF(C43<>\"\",1,2)","v":1}]
[null,null,null,null,null,null,null,null,null,null,null,null,null,null,2]
[null,null,null,null,null,null,null,null,null,null,null,null,null,null,2]
[null,null,null,null,null,null,null,null,null,null,null,null,null,null,2]
[null,null,null,null,null,null,null,null,null,null,null,null,null,null,2]
[null,null,{"$f":"IF('1. Algemeen'!E63:H63<>\"\",'1. Algemeen'!E63:H63,\"\")","v":""},"","","",null,null,null,null,null,null,null,null,2]
[null,null,null,null,null,null,null,null,null,null,null,null,null,null,1]
[null,null,"U streeft de volgende wettelijke doelen na in het projectgebied:",null,null,null,null,null,null,null,null,null,null,null,1]
[null,null,{"$f":"_xlfn._xlws.FILTER('1. Algemeen'!C67:C70,'1. Algemeen'!F67:F70=TRUE,\"niet opgegeven\")","v":"niet opgegeven"},null,null,null,null,null,null,null,null,null,null,null,{"$f":"IF(C51<>\"\",1,2)","v":1}]
[null,null,null,null,null,null,null,null,null,null,null,null,null,null,{"$f":"IF(C52<>\"\",1,2)","v":2}]
[null,null,null,null,null,null,null,null,null,null,null,null,null,null,{"$f":"IF(C53<>\"\",1,2)","v":2}]
[null,null,null,null,null,null,null,null,null,null,null,null,null,null,{"$f":"IF(C54<>\"\",1,2)","v":2}]
[null,null,null,null,null,null,null,null,null,null,null,null,null,null,1]
[null,null,null,null,null,null,null,null,null,null,null,null,null,null,1]
["- HUIDIGE SITUATIE -                                                                                                       - HUIDIGE SITUATIE -                                                                                                       - HUIDIGE SITUATIE -                                                                                                       - HUIDIGE SITUATIE -                                                                                                       - HUIDIGE SITUATIE -                                                                                                       - HUIDIGE SITUATIE -                                                                                                       - HUIDIGE SITUATIE -                                                                                                       - HUIDIGE SITUATIE -      ",null,null,null,null,null,null,null,null,null,null,null,null,null,1,"- TOEKOMSTIGE SITUATIE -                                                                                           - TOEKOMSTIGE SITUATIE -                                                                                           - TOEKOMSTIGE SITUATIE -                                                                                           - TOEKOMSTIGE SITUATIE -                                                                                           - TOEKOMSTIGE SITUATIE -                                                                                           - TOEKOMSTIGE SITUATIE -                                                                                           - TOEKOMSTIGE SITUATIE -                                                                                           - TOEKOMSTIGE SITUATIE -      "]
[null,null,"OVERZICHT BEPALING RISICO'S: HUIDIGE SITUATIE",null,null,null,null,null,null,null,null,null,null,null,1,null,null,"OVERZICHT BEPALING RISICO'S: TOEKOMSTIGE SITUATIE / VERSTORING / FYSIEKE INGREEP"]
[null,null,null,null,null,null,null,null,null,null,null,null,null,null,1]
[null,null,"In dit blok worden de risico's gepresenteerd voor de huidige situatie op basis van uw invoer en alleen voor de geselecteerde functies in het projectgebied.",null,null,null,null,null,null,null,null,null,null,null,1,null,null,"In dit blok worden de risico's gepresenteerd voor de toekomstige situatie op basis van uw invoer en alleen voor de geselecteerde functies in het projectgebied."]
[null,null,null,null,null,null,null,null,null,null,null,null,null,null,1,null,null,"Hierbij kan het gaan om een verstoring (toets op tijdelijke verzilting of verzoeting) of om een fysieke ingreep."]
[null,null,"Landbouw",null,null,null,null,null,null,null,null,null,null,null,{"$f":"IF('1. Algemeen'!$F$58=TRUE,1,2)","v":2},null,null,"Landbouw"]
[null,null,null,null,null,null,null,null,null,null,null,null,null,null,{"$f":"IF('1. Algemeen'!$F$58=TRUE,1,2)","v":2}]
[null,null,"Abiotiek",null,null,null,null,null,null,null,null,null,null,null,{"$f":"IF('1. Algemeen'!$F$58=TRUE,1,2)","v":2}]
[null,null,null,null,null,null,null,null,null,null,null,null,null,null,{"$f":"IF('1. Algemeen'!$F$58=TRUE,1,2)","v":2}]
[null,null,"Irrigatievolume",null,null,null,null,null,null,null,null,null,null,null,{"$f":"IF('1. Algemeen'!$F$58=TRUE,1,2)","v":2},null,null,"Irrigatievolume"]
[null,null,"Een te groot irrigatievolume kan leiden tot een te grote opbouw van natrium in de bodem. Dit is met name bij grote volumes gietwater slecht voor de bodemtextuur.",null,null,null,null,null,null,null,null,null,null,null,{"$f":"IF('1. Algemeen'!$F$58=TRUE,1,2)","v":2},null,null,"Idem als onder de huidige situatie"]
[null,null,"Het wordt aangeraden om EC-waardes te gebruiken (algemene gegevens), omdat natrium (en indirect daarmee de effecten van natrium) worden meegenomen in de ",null,null,null,null,null,null,null,null,null,null,null,{"$f":"IF('1. Algemeen'!$F$58=TRUE,1,2)","v":2}]
[null,null,"beoordeling.",null,null,null,null,null,null,null,null,null,null,null,{"$f":"IF('1. Algemeen'!$F$58=TRUE,1,2)","v":2}]
[null,null,"Het ingevulde irrigatievolume is:",{"$f":"IF(volume_irrigatie<>0,_xlfn.CONCAT(volume_irrigatie,\" mm/jaar\"),\"niet opgegeven\")","v":"niet opgegeven"},null,null,null,null,null,null,null,null,null,null,{"$f":"IF('1. Algemeen'!$F$58=TRUE,1,2)","v":2}]
[null,null,"Dit resulteert in het volgende risico:",{"$f":"'Risicolegger landbouw'!D5","v":"niet opgegeven"},null,null,null,null,null,null,null,null,null,null,{"$f":"IF('1. Algemeen'!$F$58=TRUE,1,2)","v":2}]
[null,null,{"$f":"IF(D71=\"laag\",\"N.B.: Het risico t.a.v. het irrigatievolume is laag. Effecten op doelgewassen (op sierteelt en boomteelt na), hieronder aangegeven onder 'Biotiek' kunnen op basis van\",\"\")","v":""},null,null,null,null,null,null,null,null,null,null,null,{"$f":"IF('1. Algemeen'!$F$58=TRUE,1,2)","v":2}]
[null,null,{"$f":"IF(D71=\"laag\",\"een extern deskundigenoordeel ook naar 'laag' worden bijgesteld.\",\"\")","v":""},null,null,null,null,null,null,null,null,null,null,null,{"$f":"IF('1. Algemeen'!$F$58=TRUE,1,2)","v":2}]
[null,null,null,null,null,null,null,null,null,null,null,null,null,null,{"$f":"IF('1. Algemeen'!$F$58=TRUE,1,2)","v":2}]
[null,null,"Ingevoerde irrigatietechniek:",{"$f":"IF('2. Landbouw'!K31<>\"\",'2. Landbouw'!K31,\"niet opgegeven\")","v":"niet opgegeven"},null,null,null,null,null,null,null,null,null,null,{"$f":"IF('1. Algemeen'!$F$58=TRUE,1,2)","v":2}]
[null,null,"Irrigatie in de maanden:",{"$f":"IF('2. Landbouw'!K34<>\"\",'2. Landbouw'!K34,\"niet opgegeven\")","v":"niet opgegeven"},null,null,null,null,null,null,null,null,null,null,{"$f":"IF('1. Algemeen'!$F$58=TRUE,1,2)","v":2}]
[null,null,null,null,null,null,null,null,null,null,null,null,null,null,{"$f":"IF('1. Algemeen'!$F$58=TRUE,1,2)","v":2}]
[null,null,"Bodemtextuur",null,null,null,null,null,null,null,null,null,null,null,{"$f":"IF('1. Algemeen'!$F$58=TRUE,1,2)","v":2},null,null,"Bodemtextuur"]
[null,null,"Hoe kleiiger de bodem, hoe groter de risico's zijn bij verzilting. Als echter de bodemstructuur (het klei-humuscomplex) in goede toestand verkeert (alleen relevant",null,null,null,null,null,null,null,null,null,null,null,{"$f":"IF('1. Algemeen'!$F$58=TRUE,1,2)","v":2},null,null,"Idem als onder de huidige situatie"]
[null,null,"voor kleiige bodems) is, en het organische stofgehalte hoog dan wordt het risico voor een kleibodem met 1 niveau verlaagd.",null,null,null,null,null,null,null,null,null,null,null,{"$f":"IF('1. Algemeen'!$F$58=TRUE,1,2)","v":2}]
[null,null,"Risico t.a.v. de bodemtextuur",{"$f":"'Risicolegger landbouw'!D17","v":"niet opgegeven"},null,null,null,null,null,null,null,null,null,null,{"$f":"IF('1. Algemeen'!$F$58=TRUE,1,2)","v":2}]
[null,null,null,null,null,null,null,null,null,null,null,null,null,null,{"$f":"IF('1. Algemeen'!$F$58=TRUE,1,2)","v":2}]
[null,null,"Biotiek",null,null,null,null,null,null,null,null,null,null,null,{"$f":"IF('1. Algemeen'!$F$58=TRUE,1,2)","v":2},null,null,"Biotiek"]
[null,null,null,null,null,null,null,null,null,null,null,null,null,null,{"$f":"IF('1. Algemeen'!$F$58=TRUE,1,2)","v":2}]
[null,null,"Doelgewassen",null,null,null,null,null,null,null,null,null,null,null,{"$f":"IF('1. Algemeen'!$F$58=TRUE,1,2)","v":2},null,null,"Doelgewassen"]
[null,null,"Een samenvatting van de verwachte risico's op effecten door zoet-zout dynamiek voor de geselecteerde doelgewassen.",null,null,null,null,null,null,null,null,null,null,null,{"$f":"IF('1. Algemeen'!$F$58=TRUE,1,2)","v":2},null,null,"Een samenvatting van de verwachte risico's op effecten door zoet-zout dynamiek voor de geselecteerde doelgewassen."]
[null,null,"Het risico is bepaald als hoogste risico tijdens de verschillende groei stadia. Hierbij is sec gekeken naar de eigenschappen van het doelgewas.",null,null,null,null,null,null,null,null,null,null,null,{"$f":"IF('1. Algemeen'!$F$58=TRUE,1,2)","v":2},null,null,"Het risico is bepaald als hoogste risico tijdens de verschillende groei stadia. Hierbij is sec gekeken naar de eigenschappen van het doelgewas."]
[null,null,"Het kan zijn dat een risico hier gevoelsmatig hoger wordt ingeschat, bijvoorbeeld omdat voor sommige doelsoorten de kiemfase gevoeliger is voor zout.",null,null,null,null,null,null,null,null,null,null,null,{"$f":"IF('1. Algemeen'!$F$58=TRUE,1,2)","v":2},null,null,"Het kan zijn dat een risico hier gevoelsmatig hoger wordt ingeschat, bijvoorbeeld omdat voor sommige doelsoorten de kiemfase gevoeliger is voor zout."]
[null,null,"Het is echter van belang dit in de context te plaatsen van het jaargetijde (tijdens welke fase(n) treedt verzilting met name op) en naar het irrigatievolume.",null,null,null,null,null,null,null,null,null,null,null,{"$f":"IF('1. Algemeen'!$F$58=TRUE,1,2)","v":2},null,null,"Het is echter van belang dit in de context te plaatsen van het jaargetijde (tijdens welke fase(n) treedt verzilting met name op) en naar het irrigatievolume."]
[null,null,"Zolang het irrigatievolume laag is, lopen de meeste doelgewassen (op sierteelt en boomteelt na) geen significant risico op effecten door verzilting.",null,null,null,null,null,null,null,null,null,null,null,{"$f":"IF('1. Algemeen'!$F$58=TRUE,1,2)","v":2},null,null,"Zolang het irrigatievolume laag is, lopen de meeste doelgewassen (op sierteelt en boomteelt na) geen significant risico op effecten door verzilting."]
[null,null,"Voor een uitgebreidere risicobepaling wordt u verwezen naar het tabblad Risicolegger landbouw.",null,null,null,null,null,null,null,null,null,null,null,{"$f":"IF('1. Algemeen'!$F$58=TRUE,1,2)","v":2},null,null,"Voor een uitgebreidere risicobepaling wordt u verwezen naar het tabblad Risicolegger landbouw."]
[]
[null,null,"Doelgewas","Risico huidige situatie",null,null,null,null,null,"Risico huidig (conservatief)",null,null,null,null,{"$f":"IF('1. Algemeen'!$F$58=TRUE,1,2)","v":2},null,null,"Doelgewas","Risico toekomst",null,"Risico toekomst (conservatief)"]
[null,null,{"$f":"_xlfn._xlws.FILTER('2. Landbouw'!C10:C20,'2. Landbouw'!F10:F20=TRUE,\"geen doelgewas gekozen\")","v":"geen doelgewas gekozen"},{"$f":"_xlfn.XLOOKUP(C94,'Risicolegger landbouw'!$D$79:$N$79,'Risicolegger landbouw'!$D$106:$N$106,\"\")","v":""},null,null,null,null,null,{"$f":"_xlfn.XLOOKUP(C94,'Risicolegger landbouw'!$D$79:$N$79,'Risicolegger landbouw'!$D$131:$N$131,\"\")","v":""},null,null,null,null,{"$f":"IF('1. Algemeen'!$F$58=TRUE,IF(C94<>\"\",1,2),2)","v":2},null,null,{"$f":"C94","v":"geen doelgewas gekozen"},{"$f":"_xlfn.XLOOKUP(R94,'Risicolegger landbouw'!$D$142:$N$142,'Risicolegger landbouw'!$D$165:$N$165,\"\")","v":""},null,{"$f":"_xlfn.XLOOKUP(R94,'Risicolegger landbouw'!$D$142:$N$142,'Risicolegger landbouw'!$D$190:$N$190,\"\")","v":""}]
[null,null,null,{"$f":"_xlfn.XLOOKUP(C95,'Risicolegger landbouw'!$D$79:$N$79,'Risicolegger landbouw'!$D$106:$N$106,\"\")","v":"-"},null,null,null,null,null,{"$f":"_xlfn.XLOOKUP(C95,'Risicolegger landbouw'!$D$79:$N$79,'Risicolegger landbouw'!$D$131:$N$131,\"\")","v":"-"},null,null,null,null,{"$f":"IF('1. Algemeen'!$F$58=TRUE,IF(C95<>\"\",1,2),2)","v":2},null,null,{"$f":"C95","v":0},{"$f":"_xlfn.XLOOKUP(R95,'Risicolegger landbouw'!$D$142:$N$142,'Risicolegger landbouw'!$D$165:$N$165,\"\")","v":""},null,{"$f":"_xlfn.XLOOKUP(R95,'Risicolegger landbouw'!$D$142:$N$142,'Risicolegger landbouw'!$D$190:$N$190,\"\")","v":""}]
[null,null,null,{"$f":"_xlfn.XLOOKUP(C96,'Risicolegger landbouw'!$D$79:$N$79,'Risicolegger landbouw'!$D$106:$N$106,\"\")","v":"-"},null,null,null,null,null,{"$f":"_xlfn.XLOOKUP(C96,'Risicolegger landbouw'!$D$79:$N$79,'Risicolegger landbouw'!$D$131:$N$131,\"\")","v":"-"},null,null,null,null,{"$f":"IF('1. Algemeen'!$F$58=TRUE,IF(C96<>\"\",1,2),2)","v":2},null,null,0,{"$f":"_xlfn.XLOOKUP(R96,'Risicolegger landbouw'!$D$142:$N$142,'Risicolegger landbouw'!$D$165:$N$165,\"\")","v":""},null,{"$f":"_xlfn.XLOOKUP(R96,'Risicolegger landbouw'!$D$142:$N$142,'Risicolegger landbouw'!$D$190:$N$190,\"\")","v":""}]
[null,null,null,{"$f":"_xlfn.XLOOKUP(C97,'Risicolegger landbouw'!$D$79:$N$79,'Risicolegger landbouw'!$D$106:$N$106,\"\")","v":"-"},null,null,null,null,null,{"$f":"_xlfn.XLOOKUP(C97,'Risicolegger landbouw'!$D$79:$N$79,'Risicolegger landbouw'!$D$131:$N$131,\"\")","v":"-"},null,null,null,null,{"$f":"IF('1. Algemeen'!$F$58=TRUE,IF(C97<>\"\",1,2),2)","v":2},null,null,0,{"$f":"_xlfn.XLOOKUP(R97,'Risicolegger landbouw'!$D$142:$N$142,'Risicolegger landbouw'!$D$165:$N$165,\"\")","v":""},null,{"$f":"_xlfn.XLOOKUP(R97,'Risicolegger landbouw'!$D$142:$N$142,'Risicolegger landbouw'!$D$190:$N$190,\"\")","v":""}]
[null,null,null,{"$f":"_xlfn.XLOOKUP(C98,'Risicolegger landbouw'!$D$79:$N$79,'Risicolegger landbouw'!$D$106:$N$106,\"\")","v":"-"},null,null,null,null,null,{"$f":"_xlfn.XLOOKUP(C98,'Risicolegger landbouw'!$D$79:$N$79,'Risicolegger landbouw'!$D$131:$N$131,\"\")","v":"-"},null,null,null,null,{"$f":"IF('1. Algemeen'!$F$58=TRUE,IF(C98<>\"\",1,2),2)","v":2},null,null,0,{"$f":"_xlfn.XLOOKUP(R98,'Risicolegger landbouw'!$D$142:$N$142,'Risicolegger landbouw'!$D$165:$N$165,\"\")","v":""},null,{"$f":"_xlfn.XLOOKUP(R98,'Risicolegger landbouw'!$D$142:$N$142,'Risicolegger landbouw'!$D$190:$N$190,\"\")","v":""}]
[null,null,null,{"$f":"_xlfn.XLOOKUP(C99,'Risicolegger landbouw'!$D$79:$N$79,'Risicolegger landbouw'!$D$106:$N$106,\"\")","v":"-"},null,null,null,null,null,{"$f":"_xlfn.XLOOKUP(C99,'Risicolegger landbouw'!$D$79:$N$79,'Risicolegger landbouw'!$D$131:$N$131,\"\")","v":"-"},null,null,null,null,{"$f":"IF('1. Algemeen'!$F$58=TRUE,IF(C99<>\"\",1,2),2)","v":2},null,null,0,{"$f":"_xlfn.XLOOKUP(R99,'Risicolegger landbouw'!$D$142:$N$142,'Risicolegger landbouw'!$D$165:$N$165,\"\")","v":""},null,{"$f":"_xlfn.XLOOKUP(R99,'Risicolegger landbouw'!$D$142:$N$142,'Risicolegger landbouw'!$D$190:$N$190,\"\")","v":""}]
[null,null,null,{"$f":"_xlfn.XLOOKUP(C100,'Risicolegger landbouw'!$D$79:$N$79,'Risicolegger landbouw'!$D$106:$N$106,\"\")","v":"-"},null,null,null,null,null,{"$f":"_xlfn.XLOOKUP(C100,'Risicolegger landbouw'!$D$79:$N$79,'Risicolegger landbouw'!$D$131:$N$131,\"\")","v":"-"},null,null,null,null,{"$f":"IF('1. Algemeen'!$F$58=TRUE,IF(C100<>\"\",1,2),2)","v":2},null,null,0,{"$f":"_xlfn.XLOOKUP(R100,'Risicolegger landbouw'!$D$142:$N$142,'Risicolegger landbouw'!$D$165:$N$165,\"\")","v":""},null,{"$f":"_xlfn.XLOOKUP(R100,'Risicolegger landbouw'!$D$142:$N$142,'Risicolegger landbouw'!$D$190:$N$190,\"\")","v":""}]
[null,null,null,{"$f":"_xlfn.XLOOKUP(C101,'Risicolegger landbouw'!$D$79:$N$79,'Risicolegger landbouw'!$D$106:$N$106,\"\")","v":"-"},null,null,null,null,null,{"$f":"_xlfn.XLOOKUP(C101,'Risicolegger landbouw'!$D$79:$N$79,'Risicolegger landbouw'!$D$131:$N$131,\"\")","v":"-"},null,null,null,null,{"$f":"IF('1. Algemeen'!$F$58=TRUE,IF(C101<>\"\",1,2),2)","v":2},null,null,0,{"$f":"_xlfn.XLOOKUP(R101,'Risicolegger landbouw'!$D$142:$N$142,'Risicolegger landbouw'!$D$165:$N$165,\"\")","v":""},null,{"$f":"_xlfn.XLOOKUP(R101,'Risicolegger landbouw'!$D$142:$N$142,'Risicolegger landbouw'!$D$190:$N$190,\"\")","v":""}]
[null,null,null,{"$f":"_xlfn.XLOOKUP(C102,'Risicolegger landbouw'!$D$79:$N$79,'Risicolegger landbouw'!$D$106:$N$106,\"\")","v":"-"},null,null,null,null,null,{"$f":"_xlfn.XLOOKUP(C102,'Risicolegger landbouw'!$D$79:$N$79,'Risicolegger landbouw'!$D$131:$N$131,\"\")","v":"-"},null,null,null,null,{"$f":"IF('1. Algemeen'!$F$58=TRUE,IF(C102<>\"\",1,2),2)","v":2},null,null,0,{"$f":"_xlfn.XLOOKUP(R102,'Risicolegger landbouw'!$D$142:$N$142,'Risicolegger landbouw'!$D$165:$N$165,\"\")","v":""},null,{"$f":"_xlfn.XLOOKUP(R102,'Risicolegger landbouw'!$D$142:$N$142,'Risicolegger landbouw'!$D$190:$N$190,\"\")","v":""}]
[null,null,null,{"$f":"_xlfn.XLOOKUP(C103,'Risicolegger landbouw'!$D$79:$N$79,'Risicolegger landbouw'!$D$106:$N$106,\"\")","v":"-"},null,null,null,null,null,{"$f":"_xlfn.XLOOKUP(C103,'Risicolegger landbouw'!$D$79:$N$79,'Risicolegger landbouw'!$D$131:$N$131,\"\")","v":"-"},null,null,null,null,{"$f":"IF('1. Algemeen'!$F$58=TRUE,IF(C103<>\"\",1,2),2)","v":2},null,null,0,{"$f":"_xlfn.XLOOKUP(R103,'Risicolegger landbouw'!$D$142:$N$142,'Risicolegger landbouw'!$D$165:$N$165,\"\")","v":""},null,{"$f":"_xlfn.XLOOKUP(R103,'Risicolegger landbouw'!$D$142:$N$142,'Risicolegger landbouw'!$D$190:$N$190,\"\")","v":""}]
[null,null,null,{"$f":"_xlfn.XLOOKUP(C104,'Risicolegger landbouw'!$D$79:$N$79,'Risicolegger landbouw'!$D$106:$N$106,\"\")","v":"-"},null,null,null,null,null,{"$f":"_xlfn.XLOOKUP(C104,'Risicolegger landbouw'!$D$79:$N$79,'Risicolegger landbouw'!$D$131:$N$131,\"\")","v":"-"},null,null,null,null,{"$f":"IF('1. Algemeen'!$F$58=TRUE,IF(C104<>\"\",1,2),2)","v":2},null,null,0,{"$f":"_xlfn.XLOOKUP(R104,'Risicolegger landbouw'!$D$142:$N$142,'Risicolegger landbouw'!$D$165:$N$165,\"\")","v":""},null,{"$f":"_xlfn.XLOOKUP(R104,'Risicolegger landbouw'!$D$142:$N$142,'Risicolegger landbouw'!$D$190:$N$190,\"\")","v":""}]
[null,null,null,null,null,null,null,null,null,null,null,null,null,null,{"$f":"IF('1. Algemeen'!$F$58=TRUE,1,2)","v":2}]
[null,null,"Vee drenking",null,null,null,null,null,null,null,null,null,null,null,{"$f":"IF('1. Algemeen'!$F$58=TRUE,1,2)","v":2},null,null,"Vee drenking"]
[null,null,"Een gangbare maatstaf (o.b.v. een deskundingenoordeel van The Salt Doctors) is dat vee drenking pas boven 1000 mg Cl/l of 3.8 dS/m tot risico's kan leiden.",null,null,null,null,null,null,null,null,null,null,null,{"$f":"IF('1. Algemeen'!$F$58=TRUE,1,2)","v":2},null,null,"Idem als onder de huidige situatie"]
[null,null,"Risico t.a.v. vee drenking",{"$f":"IF(veedrenking=\"\",\"niet opgegeven\",IF(OR(AND(eenheid_zoutgehalte_algemeen=\"EC-waarde\",maximaal_zout_huidig<3.8),AND(eenheid_zoutgehalte_algemeen=\"Chloridegehalte\",maximaal_zout_huidig<1000)),\"laag\",IF(eenheid_zoutgehalte_algemeen=\"\",\"niet opgegeven\",\"hoog\")))","v":"niet opgegeven"},null,null,null,null,null,null,null,null,null,null,{"$f":"IF('1. Algemeen'!$F$58=TRUE,1,2)","v":2}]
[null,null,null,null,null,null,null,null,null,null,null,null,null,null,{"$f":"IF('1. Algemeen'!$F$58=TRUE,1,2)","v":2}]
[null,null,null,null,null,null,null,null,null,null,null,null,null,null,{"$f":"IF('1. Algemeen'!$F$58=TRUE,1,2)","v":2}]
[null,null,"Onderwaternatuur",null,null,null,null,null,null,null,null,null,null,null,{"$f":"IF('1. Algemeen'!$F$59=TRUE,1,2)","v":2},null,null,"Onderwaternatuur"]
[null,null,null,null,null,null,null,null,null,null,null,null,null,null,{"$f":"$O$111","v":2}]
[null,null,null,null,null,null,null,null,null,null,null,null,null,null,{"$f":"$O$111","v":2}]
[null,null,"Abiotiek",null,null,null,null,null,null,null,null,null,null,null,2,null,null,"Abiotiek"]
[null,null,"Hier volgt een samenvatting van de verwachte risico's voor de verschillende KRW doeltypen en N2000 habitattypen t.g.v. abiotische parameters.",null,null,null,null,null,null,null,null,null,null,null,2,null,null,"Idem als onder de huidige situatie"]
[null,null,"In het bijzonder wordt gekeken naar het bodemtype, de aanwezigheid van een organische sliblaag en de ontstaansgeschiedenis.",null,null,null,null,null,null,null,null,null,null,null,2]
[null,null,"Op basis hiervan wordt op drie processen, die alle nadelig kunnen zijn voor de biotiek, een verwacht risico gegeven.",null,null,null,null,null,null,null,null,null,null,null,2]
[null,null,"KRW doeltypen",{"$f":"'Risicolegger KRW'!K10","v":"Interne eutrofiëring"},null,null,null,null,null,{"$f":"'Risicolegger KRW'!M10","v":"Sulfidetoxiciteit"},null,{"$f":"'Risicolegger KRW'!O10","v":"Ammoniumtoxiciteit"},null,null,{"$f":"IF('1. Algemeen'!$F$59=TRUE,IF(SUM('3. KRW'!H12:H31)=0,1,1),2)","v":2}]
[null,null,{"$f":"_xlfn._xlws.FILTER('3. KRW'!C12:C31,'3. KRW'!H12:H31=1,\"Er zijn nog geen KRW doeltypen geselecteerd (zie tabblad 3. KRW).\")","v":"Er zijn nog geen KRW doeltypen geselecteerd (zie tabblad 3. KRW)."},{"$f":"'Risicolegger KRW'!K11","v":"-"},null,null,null,null,null,{"$f":"'Risicolegger KRW'!M11","v":"-"},null,{"$f":"'Risicolegger KRW'!O11","v":"-"},null,null,{"$f":"IF('1. Algemeen'!$F$59=TRUE,IF(SUM('3. KRW'!H12:H31)=0,1,1),2)","v":2}]
[null,null,null,{"$f":"'Risicolegger KRW'!K12","v":"-"},null,null,null,null,null,{"$f":"'Risicolegger KRW'!M12","v":"-"},null,{"$f":"'Risicolegger KRW'!O12","v":"-"},null,null,{"$f":"IF('1. Algemeen'!$F$59=TRUE,IF(C120<>\"\",1,2),2)","v":2}]
[null,null,null,{"$f":"'Risicolegger KRW'!K13","v":"-"},null,null,null,null,null,{"$f":"'Risicolegger KRW'!M13","v":"-"},null,{"$f":"'Risicolegger KRW'!O13","v":"-"},null,null,{"$f":"IF('1. Algemeen'!$F$59=TRUE,IF(C121<>\"\",1,2),2)","v":2}]
[null,null,null,{"$f":"'Risicolegger KRW'!K14","v":"-"},null,null,null,null,null,{"$f":"'Risicolegger KRW'!M14","v":"-"},null,{"$f":"'Risicolegger KRW'!O14","v":"-"},null,null,{"$f":"IF('1. Algemeen'!$F$59=TRUE,IF(C122<>\"\",1,2),2)","v":2}]
[null,null,null,{"$f":"'Risicolegger KRW'!K15","v":"-"},null,null,null,null,null,{"$f":"'Risicolegger KRW'!M15","v":"-"},null,{"$f":"'Risicolegger KRW'!O15","v":"-"},null,null,{"$f":"IF('1. Algemeen'!$F$59=TRUE,IF(C123<>\"\",1,2),2)","v":2}]
[null,null,null,null,null,null,null,null,null,null,null,null,null,null,{"$f":"O125","v":2}]
[null,null,"N2000 habitattypen",{"$f":"'Risicolegger KRW'!K17","v":"Interne eutrofiëring"},null,null,null,null,null,{"$f":"'Risicolegger KRW'!M17","v":"Sulfidetoxiciteit"},null,{"$f":"'Risicolegger KRW'!O17","v":"Ammoniumtoxiciteit"},null,null,{"$f":"IF('1. Algemeen'!$F$59=TRUE,IF(SUM('3. KRW'!H35:H36)=0,2,1),2)","v":2}]
[null,null,{"$f":"_xlfn._xlws.FILTER('3. KRW'!C35:C36,'3. KRW'!H35:H36=1,\"Er zijn nog geen habitattypen geselecteerd (zie tabblad 3. KRW).\")","v":"Er zijn nog geen habitattypen geselecteerd (zie tabblad 3. KRW)."},{"$f":"'Risicolegger KRW'!K18","v":"-"},null,null,null,null,null,{"$f":"'Risicolegger KRW'!M18","v":"-"},null,{"$f":"'Risicolegger KRW'!O18","v":"-"},null,null,{"$f":"IF('1. Algemeen'!$F$59=TRUE,IF(SUM('3. KRW'!H35:H36)=0,2,1),2)","v":2}]
[null,null,null,{"$f":"'Risicolegger KRW'!K19","v":"-"},null,null,null,null,null,{"$f":"'Risicolegger KRW'!M19","v":"-"},null,{"$f":"'Risicolegger KRW'!O19","v":"-"},null,null,{"$f":"IF('1. Algemeen'!$F$59=TRUE,IF(C127<>\"\",1,2),2)","v":2}]
[null,null,null,null,null,null,null,null,null,null,null,null,null,null,{"$f":"$O$111","v":2}]
[null,null,"Biotiek",null,null,null,null,null,null,null,null,null,null,null,{"$f":"$O$111","v":2},null,null,"Biotiek"]
[null,null,"Huidige zoutsituatie",null,null,null,null,null,null,null,null,null,null,null,2,null,null,"Huidige zoutsituatie"]
[null,null,"De huidige zoutsituatie die is ingevoerd per KRW doeltype en N2000 habitattype. De huidige zoutsituatie is sterk bepalend voor de risico bepaling.",null,null,null,null,null,null,null,null,null,null,null,2,null,null,"Idem als onder de huidige situatie. Voor de risicobepaling van de toekomstige situatie wordt vanuit de huidige situatie geredeneerd."]
[null,null,"KRW doeltypen","Huidige zoutsituatie",null,null,null,null,null,null,null,null,null,null,{"$f":"O118","v":2}]
[null,null,{"$f":"C119","v":"Er zijn nog geen KRW doeltypen geselecteerd (zie tabblad 3. KRW)."},{"$f":"IF('3. KRW'!J77<>\"\",'3. KRW'!J77,\"-\")","v":"-"},null,null,null,null,null,null,null,null,{"$f":"'3. KRW'!K77","v":""},null,{"$f":"O119","v":2}]
[null,null,0,{"$f":"IF('3. KRW'!J78<>\"\",'3. KRW'!J78,\"-\")","v":"-"},null,null,null,null,null,null,null,null,{"$f":"'3. KRW'!K78","v":""},null,2]
[null,null,0,{"$f":"IF('3. KRW'!J79<>\"\",'3. KRW'!J79,\"-\")","v":"-"},null,null,null,null,null,null,null,null,{"$f":"'3. KRW'!K79","v":""},null,2]
[null,null,0,{"$f":"IF('3. KRW'!J80<>\"\",'3. KRW'!J80,\"-\")","v":"-"},null,null,null,null,null,null,null,null,{"$f":"'3. KRW'!K80","v":""},null,2]
[null,null,0,{"$f":"IF('3. KRW'!J81<>\"\",'3. KRW'!J81,\"-\")","v":"-"},null,null,null,null,null,null,null,null,{"$f":"'3. KRW'!K81","v":""},null,2]
[null,null,null,null,null,null,null,null,null,null,null,null,null,null,2]
[null,null,"N2000 habitattypen","Huidige zoutsituatie",null,null,null,null,null,null,null,null,null,null,2]
[null,null,{"$f":"C126","v":"Er zijn nog geen habitattypen geselecteerd (zie tabblad 3. KRW)."},{"$f":"IF('3. KRW'!J83<>\"\",'3. KRW'!J83,\"-\")","v":"-"},null,null,null,null,null,null,null,null,{"$f":"'3. KRW'!K83","v":""},null,2]
[null,null,0,{"$f":"IF('3. KRW'!J84<>\"\",'3. KRW'!J84,\"-\")","v":"-"},null,null,null,null,null,null,null,null,{"$f":"'3. KRW'!K84","v":""},null,2]
[null,null,{"$f":"IF(SUMPRODUCT(--(M133:M141=\"X\"))>0, \"X: De ingevoerde huidige zoutsituatie past niet bij dit KRW of N2000 type. Let wel: de risicobepaling hangt af van de ingevoerde zoutsituatie.\", \"\")","v":""},null,null,null,null,null,null,null,null,null,null,null,{"$f":"$O$111","v":2}]
[null,null,null,null,null,null,null,null,null,null,null,null,null,null,2]
[null,null,"Risico's tijdens verschillende jaargetijden - SAMENVATTING",null,null,null,null,null,null,null,null,null,null,null,{"$f":"$O$111","v":2},null,null,"Risico's tijdens verschillende jaargetijden - SAMENVATTING"]
[null,null,"Hier volgt een samenvatting van de risico's voor de verschillende KRW doeltypen en N2000 habitattypen tijdens de verschillende jaargetijden.",null,null,null,null,null,null,null,null,null,null,null,2,null,null,"Hier volgt een samenvatting van de risico's voor de verschillende KRW doeltypen en N2000 habitattypen tijdens de verschillende jaargetijden."]
[null,null,"Het verwachte risico hangt samen met de zoutsituatie, zoals hierboven weergegeven.",null,null,null,null,null,null,null,null,null,null,null,2,null,null,"Het verwachte risico hangt samen met de zoutsituatie, zoals ingevoerd op tabblad 3. KRW."]
[null,null,"KRW doeltypen",{"$f":"'Risicolegger KRW'!K34","v":"Voorjaar"},null,null,null,null,null,{"$f":"'Risicolegger KRW'!M34","v":"Zomer"},null,{"$f":"'Risicolegger KRW'!O34","v":"Winter"},null,null,{"$f":"O118","v":2},null,null,"KRW doeltypen",{"$f":"'Risicolegger KRW'!K57","v":"Voorjaar"},null,{"$f":"'Risicolegger KRW'!M57","v":"Zomer"},null,{"$f":"'Risicolegger KRW'!O57","v":"Winter"}]
[null,null,{"$f":"C119","v":"Er zijn nog geen KRW doeltypen geselecteerd (zie tabblad 3. KRW)."},{"$f":"'Risicolegger KRW'!K35","v":"-"},null,null,null,null,null,{"$f":"'Risicolegger KRW'!M35","v":"-"},null,{"$f":"'Risicolegger KRW'!O35","v":"-"},null,null,2,null,null,{"$f":"C148","v":"Er zijn nog geen KRW doeltypen geselecteerd (zie tabblad 3. KRW)."},{"$f":"IFERROR('Risicolegger KRW'!K58,\"-\")","v":"-"},null,{"$f":"IFERROR('Risicolegger KRW'!M58,\"-\")","v":"-"},null,{"$f":"IFERROR('Risicolegger KRW'!O58,\"-\")","v":"-"}]
[null,null,{"$f":"C120","v":0},{"$f":"'Risicolegger KRW'!K36","v":"-"},null,null,null,null,null,{"$f":"'Risicolegger KRW'!M36","v":"-"},null,{"$f":"'Risicolegger KRW'!O36","v":"-"},null,null,2,null,null,0,{"$f":"'Risicolegger KRW'!K59","v":"-"},null,{"$f":"'Risicolegger KRW'!M59","v":"-"},null,{"$f":"'Risicolegger KRW'!O59","v":"-"}]
[null,null,{"$f":"C121","v":0},{"$f":"'Risicolegger KRW'!K37","v":"-"},null,null,null,null,null,{"$f":"'Risicolegger KRW'!M37","v":"-"},null,{"$f":"'Risicolegger KRW'!O37","v":"-"},null,null,2,null,null,0,{"$f":"'Risicolegger KRW'!K60","v":"-"},null,{"$f":"'Risicolegger KRW'!M60","v":"-"},null,{"$f":"'Risicolegger KRW'!O60","v":"-"}]
[null,null,{"$f":"C122","v":0},{"$f":"'Risicolegger KRW'!K38","v":"-"},null,null,null,null,null,{"$f":"'Risicolegger KRW'!M38","v":"-"},null,{"$f":"'Risicolegger KRW'!O38","v":"-"},null,null,2,null,null,0,{"$f":"'Risicolegger KRW'!K61","v":"-"},null,{"$f":"'Risicolegger KRW'!M61","v":"-"},null,{"$f":"'Risicolegger KRW'!O61","v":"-"}]
[null,null,{"$f":"C123","v":0},{"$f":"'Risicolegger KRW'!K39","v":"-"},null,null,null,null,null,{"$f":"'Risicolegger KRW'!M39","v":"-"},null,{"$f":"'Risicolegger KRW'!O39","v":"-"},null,null,2,null,null,0,{"$f":"'Risicolegger KRW'!K62","v":"-"},null,{"$f":"'Risicolegger KRW'!M62","v":"-"},null,{"$f":"'Risicolegger KRW'!O62","v":"-"}]
[null,null,null,null,null,null,null,null,null,null,null,null,null,null,2]
[null,null,"N2000 habitattypen",{"$f":"'Risicolegger KRW'!K41","v":"Voorjaar"},null,null,null,null,null,{"$f":"'Risicolegger KRW'!M41","v":"Zomer"},null,{"$f":"'Risicolegger KRW'!O41","v":"Winter"},null,null,2,null,null,"N2000 habitattypen",{"$f":"'Risicolegger KRW'!K64","v":"Voorjaar"},null,{"$f":"'Risicolegger KRW'!M64","v":"Zomer"},null,{"$f":"'Risicolegger KRW'!O64","v":"Winter"}]
[null,null,{"$f":"C126","v":"Er zijn nog geen habitattypen geselecteerd (zie tabblad 3. KRW)."},{"$f":"'Risicolegger KRW'!K42","v":"-"},null,null,null,null,null,{"$f":"'Risicolegger KRW'!M42","v":"-"},null,{"$f":"'Risicolegger KRW'!O42","v":"-"},null,null,2,null,null,{"$f":"C155","v":"Er zijn nog geen habitattypen geselecteerd (zie tabblad 3. KRW)."},{"$f":"'Risicolegger KRW'!K65","v":"-"},null,{"$f":"'Risicolegger KRW'!M65","v":"-"},null,{"$f":"'Risicolegger KRW'!O65","v":"-"}]
[null,null,{"$f":"C127","v":0},{"$f":"'Risicolegger KRW'!K43","v":"-"},null,null,null,null,null,{"$f":"'Risicolegger KRW'!M43","v":"-"},null,{"$f":"'Risicolegger KRW'!O43","v":"-"},null,null,2,null,null,{"$f":"C156","v":0},{"$f":"'Risicolegger KRW'!K66","v":"-"},null,{"$f":"'Risicolegger KRW'!M66","v":"-"},null,{"$f":"'Risicolegger KRW'!O66","v":"-"}]
[null,null,null,null,null,null,null,null,null,null,null,null,null,null,{"$f":"$O$111","v":2}]
[null,null,"Risico's tijdens verschillende jaargetijden - VERDERE ONDERBOUWING",null,null,null,null,null,null,null,null,null,null,null,{"$f":"$O$111","v":2},null,null,"Risico's tijdens verschillende jaargetijden - VERDERE ONDERBOUWING"]
[null,null,"Per geselecteerd KRW doeltype en N2000 habitattype wordt voor de verschillende jaargetijden aangegeven welke factoren tot bovenstaande risico's leiden.",null,null,null,null,null,null,null,null,null,null,null,{"$f":"$O$111","v":2},null,null,"Per geselecteerd KRW doeltype en N2000 habitattype wordt voor de verschillende jaargetijden aangegeven welke factoren tot bovenstaande risico's leiden."]
[null,null,"Er zijn 5 factoren opgenomen:",null,null,null,null,null,null,null,null,null,null,null,{"$f":"$O$111","v":2},null,null,"Er zijn 5 factoren opgenomen:"]
[null,null,"- kwetsbare levensfase - vestiging en/of groei van met name jonge organismen wordt mogelijk geremd (met name in het voorjaar).",null,null,null,null,null,null,null,null,null,null,null,2,null,null,"- kwetsbare levensfase - vestiging en/of groei van met name jonge organismen wordt mogelijk geremd (met name in het voorjaar)."]
[null,null,"- sterfte soorten - sommige tot nagenoeg alle organismen die horen bij de geselecteerde zoutsituatie kunnen mogelijk sterven t.g.v. het zoutgehalte.",null,null,null,null,null,null,null,null,null,null,null,2,null,null,"- sterfte soorten - sommige tot nagenoeg alle organismen die horen bij de geselecteerde zoutsituatie kunnen mogelijk sterven t.g.v. het zoutgehalte."]
[null,null,"- oplading waterbodem - de waterbodem wordt in meer of mindere mate opgeladen met zout.",null,null,null,null,null,null,null,null,null,null,null,2,null,null,"- oplading waterbodem - de waterbodem wordt in meer of mindere mate opgeladen met zout."]
[null,null,"- afname waterplanten - het aandeel waterplanten neemt waarschijnlijk af.",null,null,null,null,null,null,null,null,null,null,null,2,null,null,"- afname waterplanten - het aandeel waterplanten neemt waarschijnlijk af."]
[null,null,"- voedselweb/Daphnia - Daphnia neemt sterk af of gaat dood, waardoor het voedselweb verandert.",null,null,null,null,null,null,null,null,null,null,null,2,null,null,"- voedselweb/Daphnia - Daphnia neemt sterk af of gaat dood, waardoor het voedselweb verandert."]
[null,null,"KRW doeltypen","Typen risico's",null,null,null,null,null,null,null,null,null,null,{"$f":"$O$111","v":2},null,null,"KRW doeltypen","Typen risico's"]
[null,null,{"$f":"C119","v":"Er zijn nog geen KRW doeltypen geselecteerd (zie tabblad 3. KRW)."},null,null,null,null,null,null,null,null,null,null,null,{"$f":"O119","v":2},null,null,{"$f":"C167","v":"Er zijn nog geen KRW doeltypen geselecteerd (zie tabblad 3. KRW)."}]
[null,null,"Voorjaar",{"$f":"IF($D$133=\"-\",\"-\",IF(_xlfn.TEXTJOIN(\" ; \", TRUE, _xlfn.BYCOL('Risicolegger KRW'!W33:AA33, _xlfn.LAMBDA(_xlpm.col, IF(INDEX('Risicolegger KRW'!W35:AA35, 1, COLUMNS('Risicolegger KRW'!W35:_xlpm.col))=\"Ja\", _xlpm.col, \"\"))))=\"\", \"Geen\", _xlfn.TEXTJOIN(\" ; \", TRUE, _xlfn.BYCOL('Risicolegger KRW'!W33:AA33, _xlfn.LAMBDA(_xlpm.col, IF(INDEX('Risicolegger KRW'!W35:AA35, 1, COLUMNS('Risicolegger KRW'!W35:_xlpm.col))=\"Ja\", _xlpm.col, \"\"))))))","v":"-"},null,null,null,null,null,null,null,null,null,null,{"$f":"O119","v":2},null,null,"Voorjaar",{"$f":"IF($D$133=\"-\",\"-\",IF(_xlfn.TEXTJOIN(\" ; \",TRUE,_xlfn.BYCOL('Risicolegger KRW'!W33:AA33,_xlfn.LAMBDA(_xlpm.col,IF(INDEX('Risicolegger KRW'!W58:AA58,1,COLUMNS('Risicolegger KRW'!W58:_xlpm.col))=\"Ja\",_xlpm.col,\"\"))))=\"\",\"Geen\",_xlfn.TEXTJOIN(\" ; \",TRUE,_xlfn.BYCOL('Risicolegger KRW'!W33:AA33,_xlfn.LAMBDA(_xlpm.col,IF(INDEX('Risicolegger KRW'!W58:AA58,1,COLUMNS('Risicolegger KRW'!W58:_xlpm.col))=\"Ja\",_xlpm.col,\"\"))))))","v":"-"}]
[null,null,"Zomer",{"$f":"IF($D$133=\"-\",\"-\",IF(_xlfn.TEXTJOIN(\" ; \", TRUE, _xlfn.BYCOL('Risicolegger KRW'!$AC$33:$AG$33, _xlfn.LAMBDA(_xlpm.col, IF(INDEX('Risicolegger KRW'!AC35:AG35, 1, COLUMNS('Risicolegger KRW'!AC35:_xlpm.col))=\"Ja\", _xlpm.col, \"\"))))=\"\", \"Geen\", _xlfn.TEXTJOIN(\" ; \", TRUE, _xlfn.BYCOL('Risicolegger KRW'!$AC$33:$AG$33, _xlfn.LAMBDA(_xlpm.col, IF(INDEX('Risicolegger KRW'!AC35:AG35, 1, COLUMNS('Risicolegger KRW'!AC35:_xlpm.col))=\"Ja\", _xlpm.col, \"\"))))))","v":"-"},null,null,null,null,null,null,null,null,null,null,{"$f":"O119","v":2},null,null,"Zomer",{"$f":"IF($D$133=\"-\",\"-\",IF(_xlfn.TEXTJOIN(\" ; \",TRUE,_xlfn.BYCOL('Risicolegger KRW'!$AC$33:$AG$33,_xlfn.LAMBDA(_xlpm.col,IF(INDEX('Risicolegger KRW'!AC58:AG58,1,COLUMNS('Risicolegger KRW'!AC58:_xlpm.col))=\"Ja\",_xlpm.col,\"\"))))=\"\",\"Geen\",_xlfn.TEXTJOIN(\" ; \",TRUE,_xlfn.BYCOL('Risicolegger KRW'!$AC$33:$AG$33,_xlfn.LAMBDA(_xlpm.col,IF(INDEX('Risicolegger KRW'!AC58:AG58,1,COLUMNS('Risicolegger KRW'!AC58:_xlpm.col))=\"Ja\",_xlpm.col,\"\"))))))","v":"-"}]
[null,null,"Winter",{"$f":"IF($D$133=\"-\",\"-\",IF(_xlfn.TEXTJOIN(\" ; \", TRUE, _xlfn.BYCOL('Risicolegger KRW'!$AI$33:$AM$33, _xlfn.LAMBDA(_xlpm.col, IF(INDEX('Risicolegger KRW'!AI35:AM35, 1, COLUMNS('Risicolegger KRW'!AI35:_xlpm.col))=\"Ja\", _xlpm.col, \"\"))))=\"\", \"Geen\", _xlfn.TEXTJOIN(\" ; \", TRUE, _xlfn.BYCOL('Risicolegger KRW'!$AI$33:$AM$33, _xlfn.LAMBDA(_xlpm.col, IF(INDEX('Risicolegger KRW'!AI35:AM35, 1, COLUMNS('Risicolegger KRW'!AI35:_xlpm.col))=\"Ja\", _xlpm.col, \"\"))))))","v":"-"},null,null,null,null,null,null,null,null,null,null,{"$f":"O119","v":2},null,null,"Winter",{"$f":"IF($D$133=\"-\",\"-\",IF(_xlfn.TEXTJOIN(\" ; \",TRUE,_xlfn.BYCOL('Risicolegger KRW'!$AI$33:$AM$33,_xlfn.LAMBDA(_xlpm.col,IF(INDEX('Risicolegger KRW'!AI58:AM58,1,COLUMNS('Risicolegger KRW'!AI58:_xlpm.col))=\"Ja\",_xlpm.col,\"\"))))=\"\",\"Geen\",_xlfn.TEXTJOIN(\" ; \",TRUE,_xlfn.BYCOL('Risicolegger KRW'!$AI$33:$AM$33,_xlfn.LAMBDA(_xlpm.col,IF(INDEX('Risicolegger KRW'!AI58:AM58,1,COLUMNS('Risicolegger KRW'!AI58:_xlpm.col))=\"Ja\",_xlpm.col,\"\"))))))","v":"-"}]
[null,null,{"$f":"C120","v":0},null,null,null,null,null,null,null,null,null,null,null,{"$f":"O120","v":2},null,null,{"$f":"C171","v":0}]
[null,null,"Voorjaar",{"$f":"IF($D$134=\"-\",\"-\",IF(_xlfn.TEXTJOIN(\" ; \", TRUE, _xlfn.BYCOL('Risicolegger KRW'!W33:AA33, _xlfn.LAMBDA(_xlpm.col, IF(INDEX('Risicolegger KRW'!W36:AA36, 1, COLUMNS('Risicolegger KRW'!W36:_xlpm.col))=\"Ja\", _xlpm.col, \"\"))))=\"\", \"Geen\", _xlfn.TEXTJOIN(\" ; \", TRUE, _xlfn.BYCOL('Risicolegger KRW'!W33:AA33, _xlfn.LAMBDA(_xlpm.col, IF(INDEX('Risicolegger KRW'!W36:AA36, 1, COLUMNS('Risicolegger KRW'!W36:_xlpm.col))=\"Ja\", _xlpm.col, \"\"))))))","v":"-"},null,null,null,null,null,null,null,null,null,null,{"$f":"O120","v":2},null,null,"Voorjaar",{"$f":"IF($D$134=\"-\",\"-\",IF(_xlfn.TEXTJOIN(\" ; \", TRUE, _xlfn.BYCOL('Risicolegger KRW'!W33:AA33, _xlfn.LAMBDA(_xlpm.col, IF(INDEX('Risicolegger KRW'!W59:AA59, 1, COLUMNS('Risicolegger KRW'!W59:_xlpm.col))=\"Ja\", _xlpm.col, \"\"))))=\"\", \"Geen\", _xlfn.TEXTJOIN(\" ; \", TRUE, _xlfn.BYCOL('Risicolegger KRW'!W33:AA33, _xlfn.LAMBDA(_xlpm.col, IF(INDEX('Risicolegger KRW'!W59:AA59, 1, COLUMNS('Risicolegger KRW'!W59:_xlpm.col))=\"Ja\", _xlpm.col, \"\"))))))","v":"-"}]
[null,null,"Zomer",{"$f":"IF($D$134=\"-\",\"-\",IF(_xlfn.TEXTJOIN(\" ; \", TRUE, _xlfn.BYCOL('Risicolegger KRW'!$AC$33:$AG$33, _xlfn.LAMBDA(_xlpm.col, IF(INDEX('Risicolegger KRW'!AC36:AG36, 1, COLUMNS('Risicolegger KRW'!AC36:_xlpm.col))=\"Ja\", _xlpm.col, \"\"))))=\"\", \"Geen\", _xlfn.TEXTJOIN(\" ; \", TRUE, _xlfn.BYCOL('Risicolegger KRW'!$AC$33:$AG$33, _xlfn.LAMBDA(_xlpm.col, IF(INDEX('Risicolegger KRW'!AC36:AG36, 1, COLUMNS('Risicolegger KRW'!AC36:_xlpm.col))=\"Ja\", _xlpm.col, \"\"))))))","v":"-"},null,null,null,null,null,null,null,null,null,null,{"$f":"O120","v":2},null,null,"Zomer",{"$f":"IF($D$134=\"-\",\"-\",IF(_xlfn.TEXTJOIN(\" ; \", TRUE, _xlfn.BYCOL('Risicolegger KRW'!$AC$33:$AG$33, _xlfn.LAMBDA(_xlpm.col, IF(INDEX('Risicolegger KRW'!AC59:AG59, 1, COLUMNS('Risicolegger KRW'!AC59:_xlpm.col))=\"Ja\", _xlpm.col, \"\"))))=\"\", \"Geen\", _xlfn.TEXTJOIN(\" ; \", TRUE, _xlfn.BYCOL('Risicolegger KRW'!$AC$33:$AG$33, _xlfn.LAMBDA(_xlpm.col, IF(INDEX('Risicolegger KRW'!AC59:AG59, 1, COLUMNS('Risicolegger KRW'!AC59:_xlpm.col))=\"Ja\", _xlpm.col, \"\"))))))","v":"-"}]
[null,null,"Winter",{"$f":"IF($D$134=\"-\",\"-\",IF(_xlfn.TEXTJOIN(\" ; \", TRUE, _xlfn.BYCOL('Risicolegger KRW'!$AI$33:$AM$33, _xlfn.LAMBDA(_xlpm.col, IF(INDEX('Risicolegger KRW'!AI36:AM36, 1, COLUMNS('Risicolegger KRW'!AI36:_xlpm.col))=\"Ja\", _xlpm.col, \"\"))))=\"\", \"Geen\", _xlfn.TEXTJOIN(\" ; \", TRUE, _xlfn.BYCOL('Risicolegger KRW'!$AI$33:$AM$33, _xlfn.LAMBDA(_xlpm.col, IF(INDEX('Risicolegger KRW'!AI36:AM36, 1, COLUMNS('Risicolegger KRW'!AI36:_xlpm.col))=\"Ja\", _xlpm.col, \"\"))))))","v":"-"},null,null,null,null,null,null,null,null,null,null,{"$f":"O120","v":2},null,null,"Winter",{"$f":"IF($D$134=\"-\",\"-\",IF(_xlfn.TEXTJOIN(\" ; \", TRUE, _xlfn.BYCOL('Risicolegger KRW'!$AI$33:$AM$33, _xlfn.LAMBDA(_xlpm.col, IF(INDEX('Risicolegger KRW'!AI59:AM59, 1, COLUMNS('Risicolegger KRW'!AI59:_xlpm.col))=\"Ja\", _xlpm.col, \"\"))))=\"\", \"Geen\", _xlfn.TEXTJOIN(\" ; \", TRUE, _xlfn.BYCOL('Risicolegger KRW'!$AI$33:$AM$33, _xlfn.LAMBDA(_xlpm.col, IF(INDEX('Risicolegger KRW'!AI59:AM59, 1, COLUMNS('Risicolegger KRW'!AI59:_xlpm.col))=\"Ja\", _xlpm.col, \"\"))))))","v":"-"}]
[null,null,{"$f":"C121","v":0},null,null,null,null,null,null,null,null,null,null,null,{"$f":"O121","v":2},null,null,{"$f":"C175","v":0}]
[null,null,"Voorjaar",{"$f":"IF($D$135=\"-\",\"-\",IF(_xlfn.TEXTJOIN(\" ; \", TRUE, _xlfn.BYCOL('Risicolegger KRW'!W33:AA33, _xlfn.LAMBDA(_xlpm.col, IF(INDEX('Risicolegger KRW'!W37:AA37, 1, COLUMNS('Risicolegger KRW'!W37:_xlpm.col))=\"Ja\", _xlpm.col, \"\"))))=\"\", \"Geen\", _xlfn.TEXTJOIN(\" ; \", TRUE, _xlfn.BYCOL('Risicolegger KRW'!W33:AA33, _xlfn.LAMBDA(_xlpm.col, IF(INDEX('Risicolegger KRW'!W37:AA37, 1, COLUMNS('Risicolegger KRW'!W37:_xlpm.col))=\"Ja\", _xlpm.col, \"\"))))))","v":"-"},null,null,null,null,null,null,null,null,null,null,{"$f":"O121","v":2},null,null,"Voorjaar",{"$f":"IF($D$135=\"-\",\"-\",IF(_xlfn.TEXTJOIN(\" ; \",TRUE,_xlfn.BYCOL('Risicolegger KRW'!W33:AA33,_xlfn.LAMBDA(_xlpm.col,IF(INDEX('Risicolegger KRW'!W60:AA60,1,COLUMNS('Risicolegger KRW'!W60:_xlpm.col))=\"Ja\",_xlpm.col,\"\"))))=\"\",\"Geen\",_xlfn.TEXTJOIN(\" ; \",TRUE,_xlfn.BYCOL('Risicolegger KRW'!W33:AA33,_xlfn.LAMBDA(_xlpm.col,IF(INDEX('Risicolegger KRW'!W60:AA60,1,COLUMNS('Risicolegger KRW'!W60:_xlpm.col))=\"Ja\",_xlpm.col,\"\"))))))","v":"-"}]
[null,null,"Zomer",{"$f":"IF($D$135=\"-\",\"-\",IF(_xlfn.TEXTJOIN(\" ; \",TRUE,_xlfn.BYCOL('Risicolegger KRW'!$AC$33:$AG$33,_xlfn.LAMBDA(_xlpm.col,IF(INDEX('Risicolegger KRW'!AC37:AG37,1,COLUMNS('Risicolegger KRW'!AC37:_xlpm.col))=\"Ja\",_xlpm.col,\"\"))))=\"\",\"Geen\",_xlfn.TEXTJOIN(\" ; \",TRUE,_xlfn.BYCOL('Risicolegger KRW'!$AC$33:$AG$33,_xlfn.LAMBDA(_xlpm.col,IF(INDEX('Risicolegger KRW'!AC37:AG37,1,COLUMNS('Risicolegger KRW'!AC37:_xlpm.col))=\"Ja\",_xlpm.col,\"\"))))))","v":"-"},null,null,null,null,null,null,null,null,null,null,{"$f":"O121","v":2},null,null,"Zomer",{"$f":"IF($D$135=\"-\",\"-\",IF(_xlfn.TEXTJOIN(\" ; \",TRUE,_xlfn.BYCOL('Risicolegger KRW'!$AC$33:$AG$33,_xlfn.LAMBDA(_xlpm.col,IF(INDEX('Risicolegger KRW'!AC60:AG60,1,COLUMNS('Risicolegger KRW'!AC60:_xlpm.col))=\"Ja\",_xlpm.col,\"\"))))=\"\",\"Geen\",_xlfn.TEXTJOIN(\" ; \",TRUE,_xlfn.BYCOL('Risicolegger KRW'!$AC$33:$AG$33,_xlfn.LAMBDA(_xlpm.col,IF(INDEX('Risicolegger KRW'!AC60:AG60,1,COLUMNS('Risicolegger KRW'!AC60:_xlpm.col))=\"Ja\",_xlpm.col,\"\"))))))","v":"-"}]
[null,null,"Winter",{"$f":"IF($D$135=\"-\",\"-\",IF(_xlfn.TEXTJOIN(\" ; \",TRUE,_xlfn.BYCOL('Risicolegger KRW'!$AI$33:$AM$33,_xlfn.LAMBDA(_xlpm.col,IF(INDEX('Risicolegger KRW'!AI37:AM37,1,COLUMNS('Risicolegger KRW'!AI37:_xlpm.col))=\"Ja\",_xlpm.col,\"\"))))=\"\",\"Geen\",_xlfn.TEXTJOIN(\" ; \",TRUE,_xlfn.BYCOL('Risicolegger KRW'!$AI$33:$AM$33,_xlfn.LAMBDA(_xlpm.col,IF(INDEX('Risicolegger KRW'!AI37:AM37,1,COLUMNS('Risicolegger KRW'!AI37:_xlpm.col))=\"Ja\",_xlpm.col,\"\"))))))","v":"-"},null,null,null,null,null,null,null,null,null,null,{"$f":"O121","v":2},null,null,"Winter",{"$f":"IF($D$135=\"-\",\"-\",IF(_xlfn.TEXTJOIN(\" ; \",TRUE,_xlfn.BYCOL('Risicolegger KRW'!$AI$33:$AM$33,_xlfn.LAMBDA(_xlpm.col,IF(INDEX('Risicolegger KRW'!AI60:AM60,1,COLUMNS('Risicolegger KRW'!AI60:_xlpm.col))=\"Ja\",_xlpm.col,\"\"))))=\"\",\"Geen\",_xlfn.TEXTJOIN(\" ; \",TRUE,_xlfn.BYCOL('Risicolegger KRW'!$AI$33:$AM$33,_xlfn.LAMBDA(_xlpm.col,IF(INDEX('Risicolegger KRW'!AI60:AM60,1,COLUMNS('Risicolegger KRW'!AI60:_xlpm.col))=\"Ja\",_xlpm.col,\"\"))))))","v":"-"}]
[null,null,{"$f":"C122","v":0},null,null,null,null,null,null,null,null,null,null,null,{"$f":"O122","v":2},null,null,{"$f":"C179","v":0}]
[null,null,"Voorjaar",{"$f":"IF($D$136=\"-\",\"-\",IF(_xlfn.TEXTJOIN(\" ; \",TRUE,_xlfn.BYCOL('Risicolegger KRW'!W33:AA33,_xlfn.LAMBDA(_xlpm.col,IF(INDEX('Risicolegger KRW'!W38:AA38,1,COLUMNS('Risicolegger KRW'!W38:_xlpm.col))=\"Ja\",_xlpm.col,\"\"))))=\"\",\"Geen\",_xlfn.TEXTJOIN(\" ; \",TRUE,_xlfn.BYCOL('Risicolegger KRW'!W33:AA33,_xlfn.LAMBDA(_xlpm.col,IF(INDEX('Risicolegger KRW'!W38:AA38,1,COLUMNS('Risicolegger KRW'!W38:_xlpm.col))=\"Ja\",_xlpm.col,\"\"))))))","v":"-"},null,null,null,null,null,null,null,null,null,null,{"$f":"O122","v":2},null,null,"Voorjaar",{"$f":"IF($D$136=\"-\",\"-\",IF(_xlfn.TEXTJOIN(\" ; \",TRUE,_xlfn.BYCOL('Risicolegger KRW'!W33:AA33,_xlfn.LAMBDA(_xlpm.col,IF(INDEX('Risicolegger KRW'!W61:AA61,1,COLUMNS('Risicolegger KRW'!W61:_xlpm.col))=\"Ja\",_xlpm.col,\"\"))))=\"\",\"Geen\",_xlfn.TEXTJOIN(\" ; \",TRUE,_xlfn.BYCOL('Risicolegger KRW'!W33:AA33,_xlfn.LAMBDA(_xlpm.col,IF(INDEX('Risicolegger KRW'!W61:AA61,1,COLUMNS('Risicolegger KRW'!W61:_xlpm.col))=\"Ja\",_xlpm.col,\"\"))))))","v":"-"}]
[null,null,"Zomer",{"$f":"IF($D$136=\"-\",\"-\",IF(_xlfn.TEXTJOIN(\" ; \",TRUE,_xlfn.BYCOL('Risicolegger KRW'!$AC$33:$AG$33,_xlfn.LAMBDA(_xlpm.col,IF(INDEX('Risicolegger KRW'!AC38:AG38,1,COLUMNS('Risicolegger KRW'!AC38:_xlpm.col))=\"Ja\",_xlpm.col,\"\"))))=\"\",\"Geen\",_xlfn.TEXTJOIN(\" ; \",TRUE,_xlfn.BYCOL('Risicolegger KRW'!$AC$33:$AG$33,_xlfn.LAMBDA(_xlpm.col,IF(INDEX('Risicolegger KRW'!AC38:AG38,1,COLUMNS('Risicolegger KRW'!AC38:_xlpm.col))=\"Ja\",_xlpm.col,\"\"))))))","v":"-"},null,null,null,null,null,null,null,null,null,null,{"$f":"O122","v":2},null,null,"Zomer",{"$f":"IF($D$136=\"-\",\"-\",IF(_xlfn.TEXTJOIN(\" ; \",TRUE,_xlfn.BYCOL('Risicolegger KRW'!$AC$33:$AG$33,_xlfn.LAMBDA(_xlpm.col,IF(INDEX('Risicolegger KRW'!AC61:AG61,1,COLUMNS('Risicolegger KRW'!AC61:_xlpm.col))=\"Ja\",_xlpm.col,\"\"))))=\"\",\"Geen\",_xlfn.TEXTJOIN(\" ; \",TRUE,_xlfn.BYCOL('Risicolegger KRW'!$AC$33:$AG$33,_xlfn.LAMBDA(_xlpm.col,IF(INDEX('Risicolegger KRW'!AC61:AG61,1,COLUMNS('Risicolegger KRW'!AC61:_xlpm.col))=\"Ja\",_xlpm.col,\"\"))))))","v":"-"}]
[null,null,"Winter",{"$f":"IF($D$136=\"-\",\"-\",IF(_xlfn.TEXTJOIN(\" ; \",TRUE,_xlfn.BYCOL('Risicolegger KRW'!$AI$33:$AM$33,_xlfn.LAMBDA(_xlpm.col,IF(INDEX('Risicolegger KRW'!AI38:AM38,1,COLUMNS('Risicolegger KRW'!AI38:_xlpm.col))=\"Ja\",_xlpm.col,\"\"))))=\"\",\"Geen\",_xlfn.TEXTJOIN(\" ; \",TRUE,_xlfn.BYCOL('Risicolegger KRW'!$AI$33:$AM$33,_xlfn.LAMBDA(_xlpm.col,IF(INDEX('Risicolegger KRW'!AI38:AM38,1,COLUMNS('Risicolegger KRW'!AI38:_xlpm.col))=\"Ja\",_xlpm.col,\"\"))))))","v":"-"},null,null,null,null,null,null,null,null,null,null,{"$f":"O122","v":2},null,null,"Winter",{"$f":"IF($D$136=\"-\",\"-\",IF(_xlfn.TEXTJOIN(\" ; \",TRUE,_xlfn.BYCOL('Risicolegger KRW'!$AI$33:$AM$33,_xlfn.LAMBDA(_xlpm.col,IF(INDEX('Risicolegger KRW'!AI61:AM61,1,COLUMNS('Risicolegger KRW'!AI61:_xlpm.col))=\"Ja\",_xlpm.col,\"\"))))=\"\",\"Geen\",_xlfn.TEXTJOIN(\" ; \",TRUE,_xlfn.BYCOL('Risicolegger KRW'!$AI$33:$AM$33,_xlfn.LAMBDA(_xlpm.col,IF(INDEX('Risicolegger KRW'!AI61:AM61,1,COLUMNS('Risicolegger KRW'!AI61:_xlpm.col))=\"Ja\",_xlpm.col,\"\"))))))","v":"-"}]
[null,null,{"$f":"C123","v":0},null,null,null,null,null,null,null,null,null,null,null,{"$f":"O123","v":2},null,null,{"$f":"C183","v":0}]
[null,null,"Voorjaar",{"$f":"IF($D$137=\"-\",\"-\",IF(_xlfn.TEXTJOIN(\" ; \",TRUE,_xlfn.BYCOL('Risicolegger KRW'!W33:AA33,_xlfn.LAMBDA(_xlpm.col,IF(INDEX('Risicolegger KRW'!W39:AA39,1,COLUMNS('Risicolegger KRW'!W39:_xlpm.col))=\"Ja\",_xlpm.col,\"\"))))=\"\",\"Geen\",_xlfn.TEXTJOIN(\" ; \",TRUE,_xlfn.BYCOL('Risicolegger KRW'!W33:AA33,_xlfn.LAMBDA(_xlpm.col,IF(INDEX('Risicolegger KRW'!W39:AA39,1,COLUMNS('Risicolegger KRW'!W39:_xlpm.col))=\"Ja\",_xlpm.col,\"\"))))))","v":"-"},null,null,null,null,null,null,null,null,null,null,{"$f":"O123","v":2},null,null,"Voorjaar",{"$f":"IF($D$137=\"-\",\"-\",IF(_xlfn.TEXTJOIN(\" ; \",TRUE,_xlfn.BYCOL('Risicolegger KRW'!W33:AA33,_xlfn.LAMBDA(_xlpm.col,IF(INDEX('Risicolegger KRW'!W62:AA62,1,COLUMNS('Risicolegger KRW'!W62:_xlpm.col))=\"Ja\",_xlpm.col,\"\"))))=\"\",\"Geen\",_xlfn.TEXTJOIN(\" ; \",TRUE,_xlfn.BYCOL('Risicolegger KRW'!W33:AA33,_xlfn.LAMBDA(_xlpm.col,IF(INDEX('Risicolegger KRW'!W62:AA62,1,COLUMNS('Risicolegger KRW'!W62:_xlpm.col))=\"Ja\",_xlpm.col,\"\"))))))","v":"-"}]
[null,null,"Zomer",{"$f":"IF($D$137=\"-\",\"-\",IF(_xlfn.TEXTJOIN(\" ; \",TRUE,_xlfn.BYCOL('Risicolegger KRW'!$AC$33:$AG$33,_xlfn.LAMBDA(_xlpm.col,IF(INDEX('Risicolegger KRW'!AC39:AG39,1,COLUMNS('Risicolegger KRW'!AC39:_xlpm.col))=\"Ja\",_xlpm.col,\"\"))))=\"\",\"Geen\",_xlfn.TEXTJOIN(\" ; \",TRUE,_xlfn.BYCOL('Risicolegger KRW'!$AC$33:$AG$33,_xlfn.LAMBDA(_xlpm.col,IF(INDEX('Risicolegger KRW'!AC39:AG39,1,COLUMNS('Risicolegger KRW'!AC39:_xlpm.col))=\"Ja\",_xlpm.col,\"\"))))))","v":"-"},null,null,null,null,null,null,null,null,null,null,{"$f":"O123","v":2},null,null,"Zomer",{"$f":"IF($D$137=\"-\",\"-\",IF(_xlfn.TEXTJOIN(\" ; \",TRUE,_xlfn.BYCOL('Risicolegger KRW'!$AC$33:$AG$33,_xlfn.LAMBDA(_xlpm.col,IF(INDEX('Risicolegger KRW'!AC62:AG62,1,COLUMNS('Risicolegger KRW'!AC62:_xlpm.col))=\"Ja\",_xlpm.col,\"\"))))=\"\",\"Geen\",_xlfn.TEXTJOIN(\" ; \",TRUE,_xlfn.BYCOL('Risicolegger KRW'!$AC$33:$AG$33,_xlfn.LAMBDA(_xlpm.col,IF(INDEX('Risicolegger KRW'!AC62:AG62,1,COLUMNS('Risicolegger KRW'!AC62:_xlpm.col))=\"Ja\",_xlpm.col,\"\"))))))","v":"-"}]
[null,null,"Winter",{"$f":"IF($D$137=\"-\",\"-\",IF(_xlfn.TEXTJOIN(\" ; \",TRUE,_xlfn.BYCOL('Risicolegger KRW'!$AI$33:$AM$33,_xlfn.LAMBDA(_xlpm.col,IF(INDEX('Risicolegger KRW'!AI39:AM39,1,COLUMNS('Risicolegger KRW'!AI39:_xlpm.col))=\"Ja\",_xlpm.col,\"\"))))=\"\",\"Geen\",_xlfn.TEXTJOIN(\" ; \",TRUE,_xlfn.BYCOL('Risicolegger KRW'!$AI$33:$AM$33,_xlfn.LAMBDA(_xlpm.col,IF(INDEX('Risicolegger KRW'!AI39:AM39,1,COLUMNS('Risicolegger KRW'!AI39:_xlpm.col))=\"Ja\",_xlpm.col,\"\"))))))","v":"-"},null,null,null,null,null,null,null,null,null,null,{"$f":"O123","v":2},null,null,"Winter",{"$f":"IF($D$137=\"-\",\"-\",IF(_xlfn.TEXTJOIN(\" ; \",TRUE,_xlfn.BYCOL('Risicolegger KRW'!$AI$33:$AM$33,_xlfn.LAMBDA(_xlpm.col,IF(INDEX('Risicolegger KRW'!AI62:AM62,1,COLUMNS('Risicolegger KRW'!AI62:_xlpm.col))=\"Ja\",_xlpm.col,\"\"))))=\"\",\"Geen\",_xlfn.TEXTJOIN(\" ; \",TRUE,_xlfn.BYCOL('Risicolegger KRW'!$AI$33:$AM$33,_xlfn.LAMBDA(_xlpm.col,IF(INDEX('Risicolegger KRW'!AI62:AM62,1,COLUMNS('Risicolegger KRW'!AI62:_xlpm.col))=\"Ja\",_xlpm.col,\"\"))))))","v":"-"}]
[null,null,null,null,null,null,null,null,null,null,null,null,null,null,{"$f":"$O$111","v":2}]
[null,null,"N2000 habitattypen","Typen risico's",null,null,null,null,null,null,null,null,null,null,2,null,null,"N2000 habitattypen","Typen risico's"]
[null,null,{"$f":"C126","v":"Er zijn nog geen habitattypen geselecteerd (zie tabblad 3. KRW)."},null,null,null,null,null,null,null,null,null,null,null,{"$f":"O126","v":2},null,null,{"$f":"C189","v":"Er zijn nog geen habitattypen geselecteerd (zie tabblad 3. KRW)."}]
[null,null,"Voorjaar",{"$f":"IF($D$140=\"-\",\"-\",IF(_xlfn.TEXTJOIN(\" ; \",TRUE,_xlfn.BYCOL('Risicolegger KRW'!W33:AA33,_xlfn.LAMBDA(_xlpm.col,IF(INDEX('Risicolegger KRW'!W42:AA42,1,COLUMNS('Risicolegger KRW'!W42:_xlpm.col))=\"Ja\",_xlpm.col,\"\"))))=\"\",\"Geen\",_xlfn.TEXTJOIN(\" ; \",TRUE,_xlfn.BYCOL('Risicolegger KRW'!W33:AA33,_xlfn.LAMBDA(_xlpm.col,IF(INDEX('Risicolegger KRW'!W42:AA42,1,COLUMNS('Risicolegger KRW'!W42:_xlpm.col))=\"Ja\",_xlpm.col,\"\"))))))","v":"-"},null,null,null,null,null,null,null,null,null,null,{"$f":"O126","v":2},null,null,"Voorjaar",{"$f":"IF($D$140=\"-\",\"-\",IF(_xlfn.TEXTJOIN(\" ; \",TRUE,_xlfn.BYCOL('Risicolegger KRW'!W33:AA33,_xlfn.LAMBDA(_xlpm.col,IF(INDEX('Risicolegger KRW'!W65:AA65,1,COLUMNS('Risicolegger KRW'!W65:_xlpm.col))=\"Ja\",_xlpm.col,\"\"))))=\"\",\"Geen\",_xlfn.TEXTJOIN(\" ; \",TRUE,_xlfn.BYCOL('Risicolegger KRW'!W33:AA33,_xlfn.LAMBDA(_xlpm.col,IF(INDEX('Risicolegger KRW'!W65:AA65,1,COLUMNS('Risicolegger KRW'!W65:_xlpm.col))=\"Ja\",_xlpm.col,\"\"))))))","v":"-"}]
[null,null,"Zomer",{"$f":"IF($D$140=\"-\",\"-\",IF(_xlfn.TEXTJOIN(\" ; \",TRUE,_xlfn.BYCOL('Risicolegger KRW'!$AC$33:$AG$33,_xlfn.LAMBDA(_xlpm.col,IF(INDEX('Risicolegger KRW'!AC42:AG42,1,COLUMNS('Risicolegger KRW'!AC42:_xlpm.col))=\"Ja\",_xlpm.col,\"\"))))=\"\",\"Geen\",_xlfn.TEXTJOIN(\" ; \",TRUE,_xlfn.BYCOL('Risicolegger KRW'!$AC$33:$AG$33,_xlfn.LAMBDA(_xlpm.col,IF(INDEX('Risicolegger KRW'!AC42:AG42,1,COLUMNS('Risicolegger KRW'!AC42:_xlpm.col))=\"Ja\",_xlpm.col,\"\"))))))","v":"-"},null,null,null,null,null,null,null,null,null,null,{"$f":"O126","v":2},null,null,"Zomer",{"$f":"IF($D$140=\"-\",\"-\",IF(_xlfn.TEXTJOIN(\" ; \",TRUE,_xlfn.BYCOL('Risicolegger KRW'!$AC$33:$AG$33,_xlfn.LAMBDA(_xlpm.col,IF(INDEX('Risicolegger KRW'!AC65:AG65,1,COLUMNS('Risicolegger KRW'!AC65:_xlpm.col))=\"Ja\",_xlpm.col,\"\"))))=\"\",\"Geen\",_xlfn.TEXTJOIN(\" ; \",TRUE,_xlfn.BYCOL('Risicolegger KRW'!$AC$33:$AG$33,_xlfn.LAMBDA(_xlpm.col,IF(INDEX('Risicolegger KRW'!AC65:AG65,1,COLUMNS('Risicolegger KRW'!AC65:_xlpm.col))=\"Ja\",_xlpm.col,\"\"))))))","v":"-"}]
[null,null,"Winter",{"$f":"IF($D$140=\"-\",\"-\",IF(_xlfn.TEXTJOIN(\" ; \",TRUE,_xlfn.BYCOL('Risicolegger KRW'!$AI$33:$AM$33,_xlfn.LAMBDA(_xlpm.col,IF(INDEX('Risicolegger KRW'!AI42:AM42,1,COLUMNS('Risicolegger KRW'!AI42:_xlpm.col))=\"Ja\",_xlpm.col,\"\"))))=\"\",\"Geen\",_xlfn.TEXTJOIN(\" ; \",TRUE,_xlfn.BYCOL('Risicolegger KRW'!$AI$33:$AM$33,_xlfn.LAMBDA(_xlpm.col,IF(INDEX('Risicolegger KRW'!AI42:AM42,1,COLUMNS('Risicolegger KRW'!AI42:_xlpm.col))=\"Ja\",_xlpm.col,\"\"))))))","v":"-"},null,null,null,null,null,null,null,null,null,null,{"$f":"O126","v":2},null,null,"Winter",{"$f":"IF($D$140=\"-\",\"-\",IF(_xlfn.TEXTJOIN(\" ; \",TRUE,_xlfn.BYCOL('Risicolegger KRW'!$AI$33:$AM$33,_xlfn.LAMBDA(_xlpm.col,IF(INDEX('Risicolegger KRW'!AI65:AM65,1,COLUMNS('Risicolegger KRW'!AI65:_xlpm.col))=\"Ja\",_xlpm.col,\"\"))))=\"\",\"Geen\",_xlfn.TEXTJOIN(\" ; \",TRUE,_xlfn.BYCOL('Risicolegger KRW'!$AI$33:$AM$33,_xlfn.LAMBDA(_xlpm.col,IF(INDEX('Risicolegger KRW'!AI65:AM65,1,COLUMNS('Risicolegger KRW'!AI65:_xlpm.col))=\"Ja\",_xlpm.col,\"\"))))))","v":"-"}]
[null,null,{"$f":"C127","v":0},null,null,null,null,null,null,null,null,null,null,null,{"$f":"O127","v":2},null,null,{"$f":"C193","v":0}]
[null,null,"Voorjaar",{"$f":"IF($D$141=\"-\",\"-\",IF(_xlfn.TEXTJOIN(\" ; \",TRUE,_xlfn.BYCOL('Risicolegger KRW'!W33:AA33,_xlfn.LAMBDA(_xlpm.col,IF(INDEX('Risicolegger KRW'!W43:AA43,1,COLUMNS('Risicolegger KRW'!W43:_xlpm.col))=\"Ja\",_xlpm.col,\"\"))))=\"\",\"Geen\",_xlfn.TEXTJOIN(\" ; \",TRUE,_xlfn.BYCOL('Risicolegger KRW'!W33:AA33,_xlfn.LAMBDA(_xlpm.col,IF(INDEX('Risicolegger KRW'!W43:AA43,1,COLUMNS('Risicolegger KRW'!W43:_xlpm.col))=\"Ja\",_xlpm.col,\"\"))))))","v":"-"},null,null,null,null,null,null,null,null,null,null,{"$f":"O127","v":2},null,null,"Voorjaar",{"$f":"IF($D$141=\"-\",\"-\",IF(_xlfn.TEXTJOIN(\" ; \",TRUE,_xlfn.BYCOL('Risicolegger KRW'!W33:AA33,_xlfn.LAMBDA(_xlpm.col,IF(INDEX('Risicolegger KRW'!W66:AA66,1,COLUMNS('Risicolegger KRW'!W66:_xlpm.col))=\"Ja\",_xlpm.col,\"\"))))=\"\",\"Geen\",_xlfn.TEXTJOIN(\" ; \",TRUE,_xlfn.BYCOL('Risicolegger KRW'!W33:AA33,_xlfn.LAMBDA(_xlpm.col,IF(INDEX('Risicolegger KRW'!W66:AA66,1,COLUMNS('Risicolegger KRW'!W66:_xlpm.col))=\"Ja\",_xlpm.col,\"\"))))))","v":"-"}]
[null,null,"Zomer",{"$f":"IF($D$141=\"-\",\"-\",IF(_xlfn.TEXTJOIN(\" ; \",TRUE,_xlfn.BYCOL('Risicolegger KRW'!$AC$33:$AG$33,_xlfn.LAMBDA(_xlpm.col,IF(INDEX('Risicolegger KRW'!AC43:AG43,1,COLUMNS('Risicolegger KRW'!AC43:_xlpm.col))=\"Ja\",_xlpm.col,\"\"))))=\"\",\"Geen\",_xlfn.TEXTJOIN(\" ; \",TRUE,_xlfn.BYCOL('Risicolegger KRW'!$AC$33:$AG$33,_xlfn.LAMBDA(_xlpm.col,IF(INDEX('Risicolegger KRW'!AC43:AG43,1,COLUMNS('Risicolegger KRW'!AC43:_xlpm.col))=\"Ja\",_xlpm.col,\"\"))))))","v":"-"},null,null,null,null,null,null,null,null,null,null,{"$f":"O127","v":2},null,null,"Zomer",{"$f":"IF($D$141=\"-\",\"-\",IF(_xlfn.TEXTJOIN(\" ; \",TRUE,_xlfn.BYCOL('Risicolegger KRW'!$AC$33:$AG$33,_xlfn.LAMBDA(_xlpm.col,IF(INDEX('Risicolegger KRW'!AC66:AG66,1,COLUMNS('Risicolegger KRW'!AC66:_xlpm.col))=\"Ja\",_xlpm.col,\"\"))))=\"\",\"Geen\",_xlfn.TEXTJOIN(\" ; \",TRUE,_xlfn.BYCOL('Risicolegger KRW'!$AC$33:$AG$33,_xlfn.LAMBDA(_xlpm.col,IF(INDEX('Risicolegger KRW'!AC66:AG66,1,COLUMNS('Risicolegger KRW'!AC66:_xlpm.col))=\"Ja\",_xlpm.col,\"\"))))))","v":"-"}]
[null,null,"Winter",{"$f":"IF($D$141=\"-\",\"-\",IF(_xlfn.TEXTJOIN(\" ; \",TRUE,_xlfn.BYCOL('Risicolegger KRW'!$AI$33:$AM$33,_xlfn.LAMBDA(_xlpm.col,IF(INDEX('Risicolegger KRW'!AI43:AM43,1,COLUMNS('Risicolegger KRW'!AI43:_xlpm.col))=\"Ja\",_xlpm.col,\"\"))))=\"\",\"Geen\",_xlfn.TEXTJOIN(\" ; \",TRUE,_xlfn.BYCOL('Risicolegger KRW'!$AI$33:$AM$33,_xlfn.LAMBDA(_xlpm.col,IF(INDEX('Risicolegger KRW'!AI43:AM43,1,COLUMNS('Risicolegger KRW'!AI43:_xlpm.col))=\"Ja\",_xlpm.col,\"\"))))))","v":"-"},null,null,null,null,null,null,null,null,null,null,{"$f":"O127","v":2},null,null,"Winter",{"$f":"IF($D$141=\"-\",\"-\",IF(_xlfn.TEXTJOIN(\" ; \",TRUE,_xlfn.BYCOL('Risicolegger KRW'!$AI$33:$AM$33,_xlfn.LAMBDA(_xlpm.col,IF(INDEX('Risicolegger KRW'!AI66:AM66,1,COLUMNS('Risicolegger KRW'!AI66:_xlpm.col))=\"Ja\",_xlpm.col,\"\"))))=\"\",\"Geen\",_xlfn.TEXTJOIN(\" ; \",TRUE,_xlfn.BYCOL('Risicolegger KRW'!$AI$33:$AM$33,_xlfn.LAMBDA(_xlpm.col,IF(INDEX('Risicolegger KRW'!AI66:AM66,1,COLUMNS('Risicolegger KRW'!AI66:_xlpm.col))=\"Ja\",_xlpm.col,\"\"))))))","v":"-"}]
[null,null,null,null,null,null,null,null,null,null,null,null,null,null,{"$f":"$O$111","v":2}]
[null,null,"EKR score",null,null,null,null,null,null,null,null,null,null,null,{"$f":"$O$111","v":2},null,null,"EKR score"]
[null,null,"U heeft de volgende EKR scores en staten van kwaliteit opgegeven. Het kan relevant zijn dit mee te nemen in de afweging hoe om te gaan met zoet-zout dynamiek.",null,null,null,null,null,null,null,null,null,null,null,{"$f":"$O$111","v":2},null,null,"Idem als onder de huidige situatie"]
[null,null,"Een hoge score betekent dat de kans op het verlies van bijzondere soorten groter kan zijn door verzilting of verzoeting.",null,null,null,null,null,null,null,null,null,null,null,{"$f":"$O$111","v":2}]
[null,null,"Een lage score kan betekenen dat het KRW doel nog verder buiten bereik komt en/of dat een habitattype kan verdwijnen bij nog meer verzilting/verzoeting.",null,null,null,null,null,null,null,null,null,null,null,{"$f":"$O$111","v":2}]
[null,null,"KRW doeltypen",null,null,null,null,"EKR score",null,null,null,null,null,null,{"$f":"O118","v":2}]
[null,null,{"$f":"C148","v":"Er zijn nog geen KRW doeltypen geselecteerd (zie tabblad 3. KRW)."},null,null,null,null,{"$f":"_xlfn._xlws.FILTER('3. KRW'!$L$12:$L$31,'3. KRW'!$C$12:$C$31=C203,\"-\")","v":"-"},null,null,null,null,null,null,2]
[null,null,{"$f":"C149","v":0},null,null,null,null,{"$f":"_xlfn._xlws.FILTER('3. KRW'!$L$12:$L$31,'3. KRW'!$C$12:$C$31=C204,\"\")","v":""},null,null,null,null,null,null,2]
[null,null,{"$f":"C150","v":0},null,null,null,null,{"$f":"_xlfn._xlws.FILTER('3. KRW'!$L$12:$L$31,'3. KRW'!$C$12:$C$31=C205,\"\")","v":""},null,null,null,null,null,null,2]
[null,null,{"$f":"C151","v":0},null,null,null,null,{"$f":"_xlfn._xlws.FILTER('3. KRW'!$L$12:$L$31,'3. KRW'!$C$12:$C$31=C206,\"\")","v":""},null,null,null,null,null,null,2]
[null,null,{"$f":"C152","v":0},null,null,null,null,{"$f":"_xlfn._xlws.FILTER('3. KRW'!$L$12:$L$31,'3. KRW'!$C$12:$C$31=C207,\"\")","v":""},null,null,null,null,null,null,2]
[null,null,null,null,null,null,null,null,null,null,null,null,null,null,2]
[null,null,"N2000 habitattypen",null,null,null,null,"Staat van kwaliteit",null,null,null,null,null,null,2]
[null,null,{"$f":"C155","v":"Er zijn nog geen habitattypen geselecteerd (zie tabblad 3. KRW)."},null,null,null,null,{"$f":"_xlfn._xlws.FILTER('3. KRW'!$L$35:$L$36,'3. KRW'!$C$35:$C$36='6. Dashboard Risico''s'!C210,\"onbekend\")","v":"onbekend"},null,null,null,null,null,null,2]
[null,null,{"$f":"C156","v":0},null,null,null,null,{"$f":"_xlfn._xlws.FILTER('3. KRW'!$L$35:$L$36,'3. KRW'!$C$35:$C$36='6. Dashboard Risico''s'!C211,\"onbekend\")","v":"onbekend"},null,null,null,null,null,null,2]
[null,null,null,null,null,null,null,null,null,null,null,null,null,null,{"$f":"$O$111","v":2}]
[null,null,null,null,null,null,null,null,null,null,null,null,null,null,{"$f":"$O$111","v":2}]
[null,null,"Terrestrische natuur",null,null,null,null,null,null,null,null,null,null,null,{"$f":"IF('1. Algemeen'!$F$60=TRUE,1,2)","v":2},null,null,"Terrestrische natuur"]
[null,null,null,null,null,null,null,null,null,null,null,null,null,null,{"$f":"IF('1. Algemeen'!$F$60=TRUE,1,2)","v":2}]
[null,null,"Abiotiek",null,null,null,null,null,null,null,null,null,null,null,{"$f":"IF('1. Algemeen'!$F$60=TRUE,1,2)","v":2},null,null,"Abiotiek"]
[null,null,"Hier volgt een samenvatting van het verwachte risico van de abiotische omstandigheden die van invloed zijn op hoe de zoet-zout dynamiek doorwerkt op de biotiek.",null,null,null,null,null,null,null,null,null,null,null,{"$f":"IF('1. Algemeen'!$F$60=TRUE,1,2)","v":2},null,null,"Idem als onder de huidige situatie"]
[null,null,"Dit risico is sec op de abiotiek en daarmee niet gespecificeerd op een beheer- of habitattype.",null,null,null,null,null,null,null,null,null,null,null,{"$f":"IF('1. Algemeen'!$F$60=TRUE,1,2)","v":2}]
[null,null,"Voor een beoordeling op de individuele aspecten van de abiotiek (bijv.: verblijftijd, land-water contact, bodemweerstand), zie tabblad Risicolegger Terrestrisch.",null,null,null,null,null,null,null,null,null,null,null,{"$f":"IF('1. Algemeen'!$F$60=TRUE,1,2)","v":2}]
[null,null,"Het totale risico voor zoete beheer- en habitattypen op abiotiek:",null,null,null,null,{"$f":"'Risicolegger Terrestrisch'!E82","v":"-"},null,null,null,null,null,null,{"$f":"IF('1. Algemeen'!$F$60=TRUE,1,2)","v":2}]
[null,null,"Het totale risico voor zilte habitattypen op abiotiek:",null,null,null,null,{"$f":"'Risicolegger Terrestrisch'!E83","v":"-"},null,null,null,null,null,null,{"$f":"IF('1. Algemeen'!$F$60=TRUE,1,2)","v":2}]
[null,null,null,null,null,null,null,null,null,null,null,null,null,null,{"$f":"IF('1. Algemeen'!$F$60=TRUE,1,2)","v":2}]
[null,null,"Biotiek",null,null,null,null,null,null,null,null,null,null,null,{"$f":"IF('1. Algemeen'!$F$60=TRUE,1,2)","v":2},null,null,"Biotiek"]
[null,null,"Hier volgt een samenvatting van het verwachte risico van de huidige situatie op de geselecteerde beheer- en habitattypen.",null,null,null,null,null,null,null,null,null,null,null,{"$f":"IF(AND('1. Algemeen'!$F$60=TRUE,bool_toets_verstoring=\"Ja - fysieke ingreep\"),1,2)","v":2},null,null,"Hier volgt een samenvatting van het verwachte risico van de fysieke ingreep op de geselecteerde beheer- en habitattypen."]
[null,null,"De beoordeling hangt sterk samen met de kwalitatieve zouttolerantie van het natuurtype en de staat van kwaliteit.",null,null,null,null,null,null,null,null,null,null,null,{"$f":"IF(AND('1. Algemeen'!$F$60=TRUE,bool_toets_verstoring=\"Ja - fysieke ingreep\"),1,2)","v":2},null,null,"De beoordeling hangt sterk samen met de kwalitatieve zouttolerantie van het natuurtype en de staat van kwaliteit."]
[null,null,null,null,null,null,null,null,null,null,null,null,null,null,{"$f":"IF(AND('1. Algemeen'!$F$60=TRUE,bool_toets_verstoring=\"Ja - fysieke ingreep\"),1,2)","v":2},null,null,"De zouttolerantie en staat van kwaliteit zijn gelijk als in de huidige situatie."]
[null,null,{"$f":"'Risicolegger Terrestrisch'!C13","v":"Geselecteerde beheertypen"},{"$f":"'Risicolegger Terrestrisch'!M13","v":"Risico voor verzilting"},null,null,null,{"$f":"'Risicolegger Terrestrisch'!M13","v":"Risico voor verzilting"},null,"Overschrijding grens?",null,"Zouttolerantie",null,null,{"$f":"IF(AND('1. Algemeen'!$F$60=TRUE,bool_toets_verstoring=\"Ja - fysieke ingreep\"),1,2)","v":2},null,null,{"$f":"C227","v":"Geselecteerde beheertypen"},"Risico toekomst",null,"Overschrijding grens?"]
[null,null,{"$f":"_xlfn._xlws.FILTER('4. Terrestrisch'!C10:C37,'4. Terrestrisch'!E10:E37=1,\"Er zijn nog geen beheertypen geselecteerd (zie tabblad tabblad 4. Terrestrisch).\")","v":"Er zijn nog geen beheertypen geselecteerd (zie tabblad tabblad 4. Terrestrisch)."},{"$f":"'Risicolegger Terrestrisch'!M14","v":"-"},null,null,null,{"$f":"'Risicolegger Terrestrisch'!M14","v":"-"},null,{"$f":"'Risicolegger Terrestrisch'!K14","v":"-"},null,{"$f":"'Risicolegger Terrestrisch'!E14","v":"-"},null,null,{"$f":"IF(AND('1. Algemeen'!$F$60=TRUE,bool_toets_verstoring=\"Ja - fysieke ingreep\"),1,2)","v":2},null,null,"Er zijn nog geen beheertypen geselecteerd (zie tabblad tabblad 4. Terrestrisch).",{"$f":"'Risicolegger Terrestrisch'!M118","v":""},null,{"$f":"'Risicolegger Terrestrisch'!K118","v":""}]
[null,null,null,{"$f":"'Risicolegger Terrestrisch'!M15","v":"-"},null,null,null,{"$f":"'Risicolegger Terrestrisch'!M15","v":"-"},null,{"$f":"'Risicolegger Terrestrisch'!K15","v":false},null,{"$f":"'Risicolegger Terrestrisch'!E15","v":""},null,null,{"$f":"IF(AND('1. Algemeen'!$F$60=TRUE,bool_toets_verstoring=\"Ja - fysieke ingreep\",C229<>\"\"),1,2)","v":2},null,null,0,{"$f":"'Risicolegger Terrestrisch'!M119","v":""},null,{"$f":"'Risicolegger Terrestrisch'!K119","v":false}]
[null,null,null,{"$f":"'Risicolegger Terrestrisch'!M16","v":"-"},null,null,null,{"$f":"'Risicolegger Terrestrisch'!M16","v":"-"},null,{"$f":"'Risicolegger Terrestrisch'!K16","v":false},null,{"$f":"'Risicolegger Terrestrisch'!E16","v":""},null,null,{"$f":"IF(AND('1. Algemeen'!$F$60=TRUE,bool_toets_verstoring=\"Ja - fysieke ingreep\",C230<>\"\"),1,2)","v":2},null,null,0,{"$f":"'Risicolegger Terrestrisch'!M120","v":""},null,{"$f":"'Risicolegger Terrestrisch'!K120","v":false}]
[null,null,null,{"$f":"'Risicolegger Terrestrisch'!M17","v":"-"},null,null,null,{"$f":"'Risicolegger Terrestrisch'!M17","v":"-"},null,{"$f":"'Risicolegger Terrestrisch'!K17","v":false},null,{"$f":"'Risicolegger Terrestrisch'!E17","v":""},null,null,{"$f":"IF(AND('1. Algemeen'!$F$60=TRUE,bool_toets_verstoring=\"Ja - fysieke ingreep\",C231<>\"\"),1,2)","v":2},null,null,0,{"$f":"'Risicolegger Terrestrisch'!M121","v":""},null,{"$f":"'Risicolegger Terrestrisch'!K121","v":false}]
[null,null,null,{"$f":"'Risicolegger Terrestrisch'!M18","v":"-"},null,null,null,{"$f":"'Risicolegger Terrestrisch'!M18","v":"-"},null,{"$f":"'Risicolegger Terrestrisch'!K18","v":false},null,{"$f":"'Risicolegger Terrestrisch'!E18","v":""},null,null,{"$f":"IF(AND('1. Algemeen'!$F$60=TRUE,bool_toets_verstoring=\"Ja - fysieke ingreep\",C232<>\"\"),1,2)","v":2},null,null,0,{"$f":"'Risicolegger Terrestrisch'!M122","v":""},null,{"$f":"'Risicolegger Terrestrisch'!K122","v":false}]
[null,null,null,null,null,null,null,null,null,null,null,null,null,null,{"$f":"IF(AND('1. Algemeen'!$F$60=TRUE,bool_toets_verstoring=\"Ja - fysieke ingreep\"),1,2)","v":2}]
[null,null,"Geselecteerde zilte habitattypen",{"$f":"'Risicolegger Terrestrisch'!M23","v":"Risico voor verzoeting"},null,null,null,{"$f":"'Risicolegger Terrestrisch'!M23","v":"Risico voor verzoeting"},null,"Onderschrijding grens?",null,"Zouttolerantie",null,null,{"$f":"IF(AND('1. Algemeen'!$F$60=TRUE,bool_toets_verstoring=\"Ja - fysieke ingreep\"),1,2)","v":2},null,null,{"$f":"C234","v":"Geselecteerde zilte habitattypen"},"Risico toekomst",null,"Onderschrijding grens?",null,"Staat van kwaliteit"]
[null,null,{"$f":"_xlfn._xlws.FILTER('4. Terrestrisch'!I10:I11,'4. Terrestrisch'!K10:K11=1,\"Er zijn nog geen zilte habitattypen geselecteerd (zie tabblad 4. Terrestrisch).\")","v":"Er zijn nog geen zilte habitattypen geselecteerd (zie tabblad 4. Terrestrisch)."},{"$f":"'Risicolegger Terrestrisch'!M24","v":"-"},null,null,null,{"$f":"'Risicolegger Terrestrisch'!M24","v":"-"},null,{"$f":"'Risicolegger Terrestrisch'!K24","v":"-"},null,{"$f":"'Risicolegger Terrestrisch'!E24","v":"-"},null,null,{"$f":"IF(AND('1. Algemeen'!$F$60=TRUE,bool_toets_verstoring=\"Ja - fysieke ingreep\"),1,2)","v":2},null,null,{"$f":"C235","v":"Er zijn nog geen zilte habitattypen geselecteerd (zie tabblad 4. Terrestrisch)."},{"$f":"'Risicolegger Terrestrisch'!M128","v":""},null,{"$f":"'Risicolegger Terrestrisch'!K128","v":""},null,{"$f":"'Risicolegger Terrestrisch'!G24","v":"-"}]
[null,null,null,{"$f":"'Risicolegger Terrestrisch'!M25","v":false},null,null,null,{"$f":"'Risicolegger Terrestrisch'!M25","v":false},null,{"$f":"'Risicolegger Terrestrisch'!K25","v":false},null,{"$f":"'Risicolegger Terrestrisch'!E25","v":""},null,null,{"$f":"IF(AND('1. Algemeen'!$F$60=TRUE,bool_toets_verstoring=\"Ja - fysieke ingreep\",C236<>\"\"),1,2)","v":2},null,null,{"$f":"C236","v":0},{"$f":"'Risicolegger Terrestrisch'!M129","v":false},null,{"$f":"'Risicolegger Terrestrisch'!K129","v":false},null,{"$f":"'Risicolegger Terrestrisch'!G25","v":"-"}]
[null,null,null,null,null,null,null,null,null,null,null,null,null,null,{"$f":"IF(AND('1. Algemeen'!$F$60=TRUE,bool_toets_verstoring=\"Ja - fysieke ingreep\"),1,2)","v":2}]
[null,null,"Geselecteerde zoete habitattypen",{"$f":"'Risicolegger Terrestrisch'!M28","v":"Risico voor verzilting"},null,null,null,{"$f":"'Risicolegger Terrestrisch'!M28","v":"Risico voor verzilting"},null,"Overschrijding grens?",null,"Zouttolerantie",null,null,{"$f":"IF(AND('1. Algemeen'!$F$60=TRUE,bool_toets_verstoring=\"Ja - fysieke ingreep\"),1,2)","v":2},null,null,{"$f":"C238","v":"Geselecteerde zoete habitattypen"},"Risico toekomst",null,"Overschrijding grens?",null,"Staat van kwaliteit"]
[null,null,{"$f":"_xlfn._xlws.FILTER('4. Terrestrisch'!I12:I34,'4. Terrestrisch'!K12:K34,\"Er zijn nog geen zoete habitattypen geselecteerd (zie tabblad 4. Terrestrisch).\")","v":"Er zijn nog geen zoete habitattypen geselecteerd (zie tabblad 4. Terrestrisch)."},{"$f":"'Risicolegger Terrestrisch'!M29","v":"-"},null,null,null,{"$f":"'Risicolegger Terrestrisch'!M29","v":"-"},null,{"$f":"'Risicolegger Terrestrisch'!K29","v":"-"},null,{"$f":"'Risicolegger Terrestrisch'!E29","v":"-"},null,null,{"$f":"IF(AND('1. Algemeen'!$F$60=TRUE,bool_toets_verstoring=\"Ja - fysieke ingreep\"),1,2)","v":2},null,null,"Er zijn nog geen zoete habitattypen geselecteerd (zie tabblad 4. Terrestrisch).",{"$f":"'Risicolegger Terrestrisch'!M133","v":""},null,{"$f":"'Risicolegger Terrestrisch'!K133","v":""},null,{"$f":"'Risicolegger Terrestrisch'!G29","v":"-"}]
[null,null,null,{"$f":"'Risicolegger Terrestrisch'!M30","v":false},null,null,null,{"$f":"'Risicolegger Terrestrisch'!M30","v":false},null,{"$f":"'Risicolegger Terrestrisch'!K30","v":false},null,{"$f":"'Risicolegger Terrestrisch'!E30","v":""},null,null,{"$f":"IF(AND('1. Algemeen'!$F$60=TRUE,bool_toets_verstoring=\"Ja - fysieke ingreep\",C240<>\"\"),1,2)","v":2},null,null,0,{"$f":"'Risicolegger Terrestrisch'!M134","v":false},null,{"$f":"'Risicolegger Terrestrisch'!K134","v":false},null,{"$f":"'Risicolegger Terrestrisch'!G30","v":"-"}]
[null,null,null,{"$f":"'Risicolegger Terrestrisch'!M31","v":false},null,null,null,{"$f":"'Risicolegger Terrestrisch'!M31","v":false},null,{"$f":"'Risicolegger Terrestrisch'!K31","v":false},null,{"$f":"'Risicolegger Terrestrisch'!E31","v":""},null,null,{"$f":"IF(AND('1. Algemeen'!$F$60=TRUE,bool_toets_verstoring=\"Ja - fysieke ingreep\",C241<>\"\"),1,2)","v":2},null,null,0,{"$f":"'Risicolegger Terrestrisch'!M135","v":false},null,{"$f":"'Risicolegger Terrestrisch'!K135","v":false},null,{"$f":"'Risicolegger Terrestrisch'!G31","v":"-"}]
[null,null,null,{"$f":"'Risicolegger Terrestrisch'!M32","v":false},null,null,null,{"$f":"'Risicolegger Terrestrisch'!M32","v":false},null,{"$f":"'Risicolegger Terrestrisch'!K32","v":false},null,{"$f":"'Risicolegger Terrestrisch'!E32","v":""},null,null,{"$f":"IF(AND('1. Algemeen'!$F$60=TRUE,bool_toets_verstoring=\"Ja - fysieke ingreep\",C242<>\"\"),1,2)","v":2},null,null,0,{"$f":"'Risicolegger Terrestrisch'!M136","v":false},null,{"$f":"'Risicolegger Terrestrisch'!K136","v":false},null,{"$f":"'Risicolegger Terrestrisch'!G32","v":"-"}]
[null,null,null,{"$f":"'Risicolegger Terrestrisch'!M33","v":false},null,null,null,{"$f":"'Risicolegger Terrestrisch'!M33","v":false},null,{"$f":"'Risicolegger Terrestrisch'!K33","v":false},null,{"$f":"'Risicolegger Terrestrisch'!E33","v":""},null,null,{"$f":"IF(AND('1. Algemeen'!$F$60=TRUE,bool_toets_verstoring=\"Ja - fysieke ingreep\",C243<>\"\"),1,2)","v":2},null,null,0,{"$f":"'Risicolegger Terrestrisch'!M137","v":false},null,{"$f":"'Risicolegger Terrestrisch'!K137","v":false},null,{"$f":"'Risicolegger Terrestrisch'!G33","v":"-"}]
[null,null,null,null,null,null,null,null,null,null,null,null,null,null,{"$f":"IF(AND('1. Algemeen'!$F$60=TRUE,bool_toets_verstoring=\"Ja - fysieke ingreep\"),1,2)","v":2}]
[null,null,null,null,null,null,null,null,null,null,null,null,null,null,{"$f":"IF(AND('1. Algemeen'!$F$60=TRUE,bool_toets_verstoring=\"Ja - fysieke ingreep\"),1,2)","v":2}]
[null,null,"Hier volgt een samenvatting van het verwachte risico van de huidige situatie op de geselecteerde beheer- en habitattypen.",null,null,null,null,null,null,null,null,null,null,null,{"$f":"IF(AND('1. Algemeen'!$F$60=TRUE,OR(bool_toets_verstoring=\"Ja - verstoring\",bool_toets_verstoring=\"Nee\",bool_toets_verstoring=\"\")),1,2)","v":2},null,null,"Hier volgt een samenvatting van het verwachte risico van de verstoring op de geselecteerde beheer- en habitattypen."]
[null,null,"De beoordeling hangt sterk samen met de kwalitatieve zouttolerantie van het natuurtype en de staat van kwaliteit.",null,null,null,null,null,null,null,null,null,null,null,{"$f":"IF(AND('1. Algemeen'!$F$60=TRUE,OR(bool_toets_verstoring=\"Ja - verstoring\",bool_toets_verstoring=\"Nee\",bool_toets_verstoring=\"\")),1,2)","v":2},null,null,"De beoordeling hangt sterk af van de karateristieken van de zoutpuls (bijv.: duur, frequentie, concentratie, omvang)."]
[null,null,{"$f":"C227","v":"Geselecteerde beheertypen"},{"$f":"'Risicolegger Terrestrisch'!M13","v":"Risico voor verzilting"},null,null,null,{"$f":"'Risicolegger Terrestrisch'!M32","v":false},null,{"$f":"J227","v":"Overschrijding grens?"},null,{"$f":"'Risicolegger Terrestrisch'!E13","v":"Zouttolerantie"},null,null,{"$f":"IF(AND('1. Algemeen'!$F$60=TRUE,OR(bool_toets_verstoring=\"Ja - verstoring\",bool_toets_verstoring=\"Nee\",bool_toets_verstoring=\"\")),1,2)","v":2},null,null,"N.B.: Ziet u nog geen getallen staan tussen de haakjes, vul deze dan eerst in op tabblad 1. Algemeen (aard verstoring) en tabblad 4. Terrestrisch (te testen verstoring)."]
[null,null,{"$f":"C228","v":"Er zijn nog geen beheertypen geselecteerd (zie tabblad tabblad 4. Terrestrisch)."},{"$f":"'Risicolegger Terrestrisch'!M14","v":"-"},null,null,null,null,null,{"$f":"IF(C249<>\"\",J228,\"\")","v":"-"},null,{"$f":"'Risicolegger Terrestrisch'!E14","v":"-"},null,null,{"$f":"IF(AND('1. Algemeen'!$F$60=TRUE,OR(bool_toets_verstoring=\"Ja - verstoring\",bool_toets_verstoring=\"Nee\",bool_toets_verstoring=\"\")),1,2)","v":2},null,null,"Eigenschappen zoutpuls","Omvangrijk?"]
[null,null,{"$f":"IF(C229<>\"\",C229,\"\")","v":""},{"$f":"IF(C250<>\"\",'Risicolegger Terrestrisch'!M15,\"\")","v":""},null,null,null,{"$f":"'Risicolegger Terrestrisch'!M37","v":0},null,{"$f":"IF(C250<>\"\",J229,\"\")","v":""},null,{"$f":"'Risicolegger Terrestrisch'!E15","v":""},null,null,{"$f":"IF(AND('1. Algemeen'!$F$60=TRUE,OR(bool_toets_verstoring=\"Ja - verstoring\",bool_toets_verstoring=\"Nee\",bool_toets_verstoring=\"\")),1,2)","v":2},null,null,{"$f":"'Risicolegger Terrestrisch'!C94","v":"Gemiddelde duur ( dagen)"},{"$f":"'Risicolegger Terrestrisch'!E94","v":"niet opgegeven"}]
[null,null,{"$f":"IF(C230<>\"\",C230,\"\")","v":""},{"$f":"IF(C251<>\"\",'Risicolegger Terrestrisch'!M16,\"\")","v":""},null,null,null,{"$f":"'Risicolegger Terrestrisch'!M38","v":0},null,"",null,{"$f":"'Risicolegger Terrestrisch'!E16","v":""},null,null,{"$f":"IF(AND('1. Algemeen'!$F$60=TRUE,OR(bool_toets_verstoring=\"Ja - verstoring\",bool_toets_verstoring=\"Nee\",bool_toets_verstoring=\"\")),1,2)","v":2},null,null,{"$f":"'Risicolegger Terrestrisch'!C95","v":"Frequentie ( keer per jaar)"},{"$f":"'Risicolegger Terrestrisch'!E95","v":"niet opgegeven"}]
[null,null,{"$f":"IF(C231<>\"\",C231,\"\")","v":""},{"$f":"IF(C252<>\"\",'Risicolegger Terrestrisch'!M17,\"\")","v":""},null,null,null,{"$f":"'Risicolegger Terrestrisch'!M39","v":0},null,"",null,{"$f":"'Risicolegger Terrestrisch'!E17","v":""},null,null,{"$f":"IF(AND('1. Algemeen'!$F$60=TRUE,OR(bool_toets_verstoring=\"Ja - verstoring\",bool_toets_verstoring=\"Nee\",bool_toets_verstoring=\"\")),1,2)","v":2},null,null,{"$f":"'Risicolegger Terrestrisch'!C96","v":"Tijdsinterval ( dagen tussen opeenvolgende verstoringen)"},{"$f":"'Risicolegger Terrestrisch'!E96","v":"niet opgegeven"}]
[null,null,{"$f":"IF(C232<>\"\",C232,\"\")","v":""},{"$f":"IF(C253<>\"\",'Risicolegger Terrestrisch'!M18,\"\")","v":""},null,null,null,{"$f":"'Risicolegger Terrestrisch'!M40","v":0},null,"",null,{"$f":"'Risicolegger Terrestrisch'!E18","v":""},null,null,{"$f":"IF(AND('1. Algemeen'!$F$60=TRUE,OR(bool_toets_verstoring=\"Ja - verstoring\",bool_toets_verstoring=\"Nee\",bool_toets_verstoring=\"\")),1,2)","v":2},null,null,{"$f":"'Risicolegger Terrestrisch'!C97","v":"Moment ()"},{"$f":"'Risicolegger Terrestrisch'!E97","v":"niet opgegeven"}]
[null,null,null,null,null,null,null,null,null,null,null,null,null,null,{"$f":"IF(AND('1. Algemeen'!$F$60=TRUE,OR(bool_toets_verstoring=\"Ja - verstoring\",bool_toets_verstoring=\"Nee\",bool_toets_verstoring=\"\")),1,2)","v":2},null,null,{"$f":"'Risicolegger Terrestrisch'!C98","v":"eenheid onbekend"},{"$f":"'Risicolegger Terrestrisch'!E98","v":"niet opgegeven"}]
[null,null,{"$f":"C234","v":"Geselecteerde zilte habitattypen"},{"$f":"'Risicolegger Terrestrisch'!M23","v":"Risico voor verzoeting"},null,null,null,{"$f":"'Risicolegger Terrestrisch'!M42","v":0},null,{"$f":"J234","v":"Onderschrijding grens?"},null,{"$f":"'Risicolegger Terrestrisch'!E23","v":"Zouttolerantie"},null,null,{"$f":"IF(AND('1. Algemeen'!$F$60=TRUE,OR(bool_toets_verstoring=\"Ja - verstoring\",bool_toets_verstoring=\"Nee\",bool_toets_verstoring=\"\")),1,2)","v":2},null,null,{"$f":"'Risicolegger Terrestrisch'!C99","v":"Omvang ( ha /  %)"},{"$f":"'Risicolegger Terrestrisch'!E99","v":"niet opgegeven"}]
[null,null,{"$f":"C235","v":"Er zijn nog geen zilte habitattypen geselecteerd (zie tabblad 4. Terrestrisch)."},{"$f":"'Risicolegger Terrestrisch'!M24","v":"-"},null,null,null,{"$f":"'Risicolegger Terrestrisch'!M43","v":0},null,{"$f":"IF(C256<>\"\",J235,\"\")","v":"-"},null,{"$f":"'Risicolegger Terrestrisch'!E24","v":"-"},null,null,{"$f":"IF(AND('1. Algemeen'!$F$60=TRUE,OR(bool_toets_verstoring=\"Ja - verstoring\",bool_toets_verstoring=\"Nee\",bool_toets_verstoring=\"\")),1,2)","v":2}]
[null,null,{"$f":"IF(C236<>\"\",C236,\"\")","v":""},{"$f":"IF(C257<>\"\",'Risicolegger Terrestrisch'!M25,\"\")","v":""},null,null,null,{"$f":"'Risicolegger Terrestrisch'!M44","v":0},null,{"$f":"IF(C257<>\"\",J236,\"\")","v":""},null,{"$f":"'Risicolegger Terrestrisch'!E25","v":""},null,null,{"$f":"IF(AND('1. Algemeen'!$F$60=TRUE,OR(bool_toets_verstoring=\"Ja - verstoring\",bool_toets_verstoring=\"Nee\",bool_toets_verstoring=\"\")),1,2)","v":2},null,null,"Conclusie:"]
[null,null,null,null,null,null,null,null,null,null,null,null,null,null,{"$f":"IF(AND('1. Algemeen'!$F$60=TRUE,OR(bool_toets_verstoring=\"Ja - verstoring\",bool_toets_verstoring=\"Nee\",bool_toets_verstoring=\"\")),1,2)","v":2},null,null,"Is de verstoring omvangrijk?",{"$f":"'Risicolegger Terrestrisch'!E102","v":"-"}]
[null,null,{"$f":"C238","v":"Geselecteerde zoete habitattypen"},{"$f":"'Risicolegger Terrestrisch'!M28","v":"Risico voor verzilting"},null,null,null,{"$f":"'Risicolegger Terrestrisch'!M47","v":0},null,{"$f":"J238","v":"Overschrijding grens?"},null,{"$f":"'Risicolegger Terrestrisch'!E28","v":"Zouttolerantie"},null,null,{"$f":"IF(AND('1. Algemeen'!$F$60=TRUE,OR(bool_toets_verstoring=\"Ja - verstoring\",bool_toets_verstoring=\"Nee\",bool_toets_verstoring=\"\")),1,2)","v":2},null,null,{"$f":"'Risicolegger Terrestrisch'!C103","v":"N.B. in de huidige versie van het afwegingskader wordt alleen de eigenschap 'concentratie' gebruikt voor de conclusie of de verstoring 'omvangrijk' is door gebrek aan kennis."}]
[null,null,{"$f":"C239","v":"Er zijn nog geen zoete habitattypen geselecteerd (zie tabblad 4. Terrestrisch)."},{"$f":"'Risicolegger Terrestrisch'!M29","v":"-"},null,null,null,{"$f":"'Risicolegger Terrestrisch'!M48","v":0},null,{"$f":"IF(C260<>\"\",J239,\"\")","v":"-"},null,{"$f":"'Risicolegger Terrestrisch'!E29","v":"-"},null,null,{"$f":"IF(AND('1. Algemeen'!$F$60=TRUE,OR(bool_toets_verstoring=\"Ja - verstoring\",bool_toets_verstoring=\"Nee\",bool_toets_verstoring=\"\")),1,2)","v":2}]
[null,null,{"$f":"IF(C240<>\"\",C240,\"\")","v":""},{"$f":"IF(C261<>\"\",'Risicolegger Terrestrisch'!M29,\"\")","v":""},null,null,null,{"$f":"'Risicolegger Terrestrisch'!M48","v":0},null,{"$f":"IF(C261<>\"\",J240,\"\")","v":""},null,{"$f":"'Risicolegger Terrestrisch'!E30","v":""},null,null,{"$f":"IF(AND('1. Algemeen'!$F$60=TRUE,OR(bool_toets_verstoring=\"Ja - verstoring\",bool_toets_verstoring=\"Nee\"),C261<>\"\"),1,2)","v":2}]
[null,null,{"$f":"IF(C241<>\"\",C241,\"\")","v":""},{"$f":"IF(C262<>\"\",'Risicolegger Terrestrisch'!M30,\"\")","v":""},null,null,null,{"$f":"'Risicolegger Terrestrisch'!M49","v":0},null,"",null,{"$f":"'Risicolegger Terrestrisch'!E31","v":""},null,null,{"$f":"IF(AND('1. Algemeen'!$F$60=TRUE,OR(bool_toets_verstoring=\"Ja - verstoring\",bool_toets_verstoring=\"Nee\"),C262<>\"\"),1,2)","v":2}]
[null,null,{"$f":"IF(C242<>\"\",C242,\"\")","v":""},{"$f":"IF(C263<>\"\",'Risicolegger Terrestrisch'!M31,\"\")","v":""},null,null,null,{"$f":"'Risicolegger Terrestrisch'!M50","v":0},null,false,null,{"$f":"'Risicolegger Terrestrisch'!E32","v":""},null,null,{"$f":"IF(AND('1. Algemeen'!$F$60=TRUE,OR(bool_toets_verstoring=\"Ja - verstoring\",bool_toets_verstoring=\"Nee\"),C263<>\"\"),1,2)","v":2}]
[null,null,{"$f":"IF(C243<>\"\",C243,\"\")","v":""},{"$f":"IF(C264<>\"\",'Risicolegger Terrestrisch'!M32,\"\")","v":""},null,null,null,{"$f":"'Risicolegger Terrestrisch'!M51","v":0},null,false,null,{"$f":"'Risicolegger Terrestrisch'!E33","v":""},null,null,{"$f":"IF(AND('1. Algemeen'!$F$60=TRUE,OR(bool_toets_verstoring=\"Ja - verstoring\",bool_toets_verstoring=\"Nee\"),C264<>\"\"),1,2)","v":2}]
[null,null,null,null,null,null,null,null,null,null,null,null,null,null,{"$f":"IF(AND('1. Algemeen'!$F$60=TRUE,OR(bool_toets_verstoring=\"Ja - verstoring\",bool_toets_verstoring=\"Nee\")),1,2)","v":2}]
[null,null,null,null,null,null,null,null,null,null,null,null,null,null,1]
[null,null,"Overig",null,null,null,null,null,null,null,null,null,null,null,1,null,null,"Overig"]
[null,null,null,null,null,null,null,null,null,null,null,null,null,null,1]
[null,null,"De volgende zaken zijn niet actief gebruikt in dit afwegingskader om te komen tot een bepaling van de verwachte risico's t.a.v. zoet-zout dynamiek.",null,null,null,null,null,null,null,null,null,null,null,1,null,null,"De functie overig wordt aangenomen gelijk te blijven onder een toekomstige situatie (zoals een verstoring of fysieke ingreep)."]
[null,null,{"$f":"IF('1. Algemeen'!F61=TRUE,\"Drinkwater\",\"\")","v":""},null,null,null,null,null,null,null,null,null,null,{"$f":"SUM(O270:O274)","v":10},{"$f":"IF(C270<>\"\",1,2)","v":2}]
[null,null,{"$f":"IF('1. Algemeen'!F62=TRUE,\"Infrastructuur\",\"\")","v":""},null,null,null,null,null,null,null,null,null,null,null,{"$f":"IF(C271<>\"\",1,2)","v":2}]
[null,null,{"$f":"IF('1. Algemeen'!E63<>\"\",'1. Algemeen'!E63,\"\")","v":""},null,null,null,null,null,null,null,null,null,null,null,{"$f":"IF(C272<>\"\",1,2)","v":2}]
[null,null,{"$f":"IF('3. KRW'!J96<>\"\",'3. KRW'!J96,\"\")","v":""},null,null,null,null,null,null,null,null,null,null,null,{"$f":"IF(C273<>\"\",1,2)","v":2}]
[null,null,{"$f":"IF(overig<>\"\",overig,\"\")","v":""},null,null,null,null,null,null,null,null,null,null,null,{"$f":"IF(C274<>\"\",1,2)","v":2}]
[null,null,"Er zijn geen overige functies of zaken opgegeven.",null,null,null,null,null,null,null,null,null,null,null,{"$f":"IF(N270=10,1,2)","v":1}]
[null,null,null,null,null,null,null,null,null,null,null,null,null,null,1]
[null,null,"Desondanks is het belangrijk om deze zaken mee te nemen in het maken van een eindafweging hoe te handelen met zoet-zout dynamiek in uw projectgebied.",null,null,null,null,null,null,null,null,null,null,null,1]
[null,null,"Let op! Het kan zijn dat nog niet alle relevante zaken (bijv. sociale belangen, drinkwatervoorziening, infrastructuur) zijn ingevoerd. Het uitblijven van overige"]
[null,null,"zaken hoeft niet direct te betekenen dat er geen andere processen of belangen lopen die van invloed kunnen zijn op de eindafweging. Dit afwegingskader"]
[null,null,"biedt een eerste overzicht maar focust met name op zoet-zout dynamiek en bijv. niet op aanvullende belangen vanuit het aspect 'verdroging'."]

{"sheet":"Risicolegger landbouw","index":7,"n_rows":198,"n_cols":20,"rows_kept":198,"cut":false,"hidden":false,"merged":[[1,0,6,0],[8,0,18,0],[194,0,198,0],[197,2,197,3],[37,2,38,2],[30,0,68,0],[70,0,133,0],[135,0,192,0]]}
[]
["BLOK 1: \nIRRIGATIEWATER"]
[null,null,"Oordeelsblok 1. watervolume irrigatiewater",null,null,null,null,null,null,null,null,null,null,null,{"$f":"IF(O2<>\"\",_xlfn.XLOOKUP('Risicolegger landbouw'!O2,'Grenswaarden landbouw'!$B$22:$B$32,'Grenswaarden landbouw'!$C$22:$C$32),\"\")","v":""},{"$f":"IF(P2<>\"\",_xlfn.XLOOKUP('Risicolegger landbouw'!P2,'Grenswaarden landbouw'!$B$22:$B$32,'Grenswaarden landbouw'!$C$22:$C$32),\"\")","v":""}]
[]
[null,null,{"$f":"_xlfn.CONCAT(\"Irrigatievolume: \", volume_irrigatie,\" mm/jaar\")","v":"Irrigatievolume: 0 mm/jaar"},{"$f":"IF(bool_irrigatie=\"Nee\",\"geen irrigatie toegepast\",IF(volume_irrigatie<>0,IF(volume_irrigatie<=80,\"laag\",IF(volume_irrigatie>200,\"hoog\",\"midden\")),\"niet opgegeven\"))","v":"niet opgegeven"}]
[null,null,"\nToelichting: een te groot irrigatievolume kan leiden tot een te grote opbouw van natrium in de bodem. Dit is met name bij grote volumes gietwater slecht voor de bodemtextuur."]
[]
[]
["BLOK 2: BODEMSTRUCTUUR",null,null,null,null,null,null,null,null,null,null,null,null,null,{"$f":"IF(O2<>\"\",_xlfn.XLOOKUP(1,('Grenswaarden landbouw'!$B$4:$B$18='1. Algemeen'!$K$18)*('Grenswaarden landbouw'!$C$4:$C$18='Risicolegger landbouw'!O3),'Grenswaarden landbouw'!$E$4:$E$18),\"\")","v":""},{"$f":"IF(P2<>\"\",_xlfn.XLOOKUP(1,('Grenswaarden landbouw'!$B$4:$B$18='1. Algemeen'!$K$18)*('Grenswaarden landbouw'!$C$4:$C$18='Risicolegger landbouw'!P3),'Grenswaarden landbouw'!$E$4:$E$18),\"\")","v":""}]
[null,null,"Oordeelsblok 2. bodemstructuur"]
[]
[null,null,{"$f":"IF(kleipercentage<>\"\",\n    _xlfn.CONCAT(\"kleipercentage: \", kleipercentage),\n    IF(bodemtype<>\"\",\n        _xlfn.CONCAT(\"bodemtype: \", bodemtype),\n        \"geen bodemtype of kleipercentage geselecteerd\"))","v":"geen bodemtype of kleipercentage geselecteerd"},{"$f":"IF(kleipercentage<>\"\",\n    IF(kleipercentage=Invoer!$E$14,\"laag\",\n        IF(kleipercentage=Invoer!$E$15,\"midden\",\n            IF(kleipercentage=Invoer!$E$16,\"hoog\",\"midden\"))),\n    IF(bodemtype<>\"\",\n        IF(OR(bodemtype=Invoer!$B$7,bodemtype=Invoer!$B$8),\"laag\",\n            IF(OR(bodemtype=Invoer!$B$6,bodemtype=Invoer!$B$4),\"midden\",\n                IF(bodemtype=Invoer!$B$5,\"hoog\",\"niet opgegeven\"))),\"niet opgegeven\"))","v":"niet opgegeven"}]
[null,null,{"$f":"IF(organische_stof=\"\",\n    \"geen organisch stofpercentage geselecteerd\",\n    _xlfn.CONCAT(\"organische stofgehalte (\", organische_stof, \")\"))","v":"geen organisch stofpercentage geselecteerd"},{"$f":"IF('2. Landbouw'!K75<>\"\",\n    IF('2. Landbouw'!$K$75=Invoer!$F$14,\"hoog\",\n        IF('2. Landbouw'!$K$75=Invoer!$F$15,\"midden\",\n            IF('2. Landbouw'!$K$75=Invoer!$F$16,\"laag\",\"niet opgegeven\"))),\"niet opgegeven\")","v":"niet opgegeven"}]
[null,null,"bodemstructuur (natrium, magnesium, calcium)",{"$f":"IF(AND(ISBLANK('2. Landbouw'!$K$77),ISBLANK('2. Landbouw'!$K$78),ISBLANK('2. Landbouw'!$K$79)),\"niet opgegeven\",\nIF($D$12=\"hoog\",\nIF(OR('2. Landbouw'!$K$77=Invoer!$G$14,'2. Landbouw'!$K$78=Invoer!$H$16,'2. Landbouw'!$K$79=Invoer!$I$15),\"hoog\",\"laag\"),\nIF($D$12=\"midden\",\nIF(OR('2. Landbouw'!$K$77=Invoer!$G$14,'2. Landbouw'!$K$78=Invoer!$H$16,'2. Landbouw'!$K$79=Invoer!$I$15),\"hoog\",\"laag\"),\"niet opgegeven\")))","v":"niet opgegeven"}]
[null,null,{"$f":"IF(NOT(ISNUMBER(SEARCH(\"laag\",D14))), \"  > Alleen relevant voor kleibodems (> 30% klei).\", \"\")","v":"  > Alleen relevant voor kleibodems (> 30% klei)."}]
[]
[null,null,"Totaal risico",{"$f":"IF(AND(D12=\"hoog\",D14=\"laag\",NOT(ISNUMBER(SEARCH(\"hoog\",D13)))), \"midden\", IF(AND(D12=\"midden\",D14=\"laag\",NOT(ISNUMBER(SEARCH(\"hoog\",D13)))),\"laag\",D12))","v":"niet opgegeven"}]
[null,null,"Hoe kleiiger de bodem, hoe groter de risico's zijn bij verzilting. Als echter de bodemstructuur (het klei-humuscomplex) in goede toestand verkeert en het organische stofgehalte hoog is, dan wordt het risico voor een *kleibodem* met 1 niveau verlaagd."]
[]
[]
[]
[null,null,"Tussenblok: tussenstand"]
[]
[null,null,"Als er vanuit het watervolume geen aanleidingen zijn voor risico's, dan zijn de risico's voor de gewassen laag."]
[null,null,"In de volgende blokken staan de eigenschappen van de geselecteerde doelgewassen, als ook de risico's tijdens de huidige en toekomstige situatie. Deze risico's zijn puur gebaseerd op de eigenschappen van de doelgewassen zelf."]
[null,null,"Het is aan de gebruiker om deze in de context te plaatsen van het watervolume en de bodemstructuur."]
[]
[]
[]
[null,null,null,null,null,null,null,null,null,null,null,null,null,null,{"$f":"IF(O2<>\"\",IF('2. Landbouw'!$K$31=Invoer!$C$14,_xlfn.XLOOKUP(O2,'Grenswaarden landbouw'!$B$22:$B$32,'Grenswaarden landbouw'!$H$22:$H$32),\"Nee\"),\"\")","v":""},{"$f":"IF(P2<>\"\",IF('2. Landbouw'!$K$31=Invoer!$C$14,_xlfn.XLOOKUP(P2,'Grenswaarden landbouw'!$B$22:$B$32,'Grenswaarden landbouw'!$H$22:$H$32),\"Nee\"),\"\")","v":""}]
["EIGENSCHAPPEN\nGESELECTEERDE DOELGEWASSEN"]
[null,null,"Kwalitatieve zouttolerantie van geselecteerde doelgewassen"]
[]
[null,null,"In dit eerste blok ziet u de kwalitatieve zouttoleranties die horen bij doelgewassen die door u zijn geselecteerd."]
[null,null,"Om uitvoer te zien, dient u te hebben aangegeven welk(e) doelgewas(sen) u wilt doorlichten en met welke zouteenheid (EC of chloride) u rekent."]
[null,null,"Maakt u gebruik van irrigatiewater dat anders is dan het oppervlaktewater, dan dient de eenheid van het zoutgehalte op tabblad '2. Landbouw' te zijn ingevuld."]
[]
[null,null,{"$f":"IF(bool_opp_irrigatie=\"Nee\", _xlfn.CONCAT(\"De eenheid van het zoutgehalte die door u is opgegeven, is: \"),\n    IF(bool_opp_irrigatie=\"Ja\", _xlfn.CONCAT(\"De eenheid van het zoutgehalte die door u is opgegeven, is: \"),\n    \"De eenheid van het zoutgehalte is nog niet door u opgegeven. Het is nog niet mogelijk risico's in te schatten.\"))","v":"De eenheid van het zoutgehalte is nog niet door u opgegeven. Het is nog niet mogelijk risico's in te schatten."},{"$f":"IF(bool_opp_irrigatie=\"Nee\",eenheid_zoutgehalte_landbouw_huidig,\nIF(bool_opp_irrigatie=\"Ja\",eenheid_zoutgehalte_algemeen,\"niet opgegeven\"))","v":"niet opgegeven"},{"$f":"IF(D38=0,\"  De eenheid van het zoutgehalte is nog niet opgegeven. Vul dit in op tabblad 1. Algemeen en op tabblad 2. Landbouw.\",\"\")","v":""},null,null,null,null,null,null,null,null,null,null,null,null,{"$f":"IF(D38=\"EC-waarde\",1,IF(D38=\"Chloridegehalte\",2,0))","v":0}]
[null,null,null,null,null,null,null,null,null,null,null,null,null,null,null,null,null,null,null,"Consequent zijn in beoordeling (standaard iets te hoog zitten)"]
[]
[null,null,"Doelgewassen",{"$f":"TRANSPOSE(_xlfn._xlws.FILTER('2. Landbouw'!C10:C20,'2. Landbouw'!F10:F20=TRUE,\"geen selectie gemaakt\"))","v":"geen selectie gemaakt"}]
[]
[null,null,"Kwalitatieve zouttoleranties"]
[null,null,"Dit is bepaald o.b.v. een deskundigenoordeel van The Salt Doctors."]
[null,null,"Algemeen voor het doelgewas",{"$f":"IF($D$41<>\"\",IFERROR(_xlfn.XLOOKUP('Risicolegger landbouw'!D41,'Grenswaarden landbouw'!$B$22:$B$32,'Grenswaarden landbouw'!$C$22:$C$32),\"onbekend\"),\"\")","v":"onbekend"},{"$f":"IF(E41<>\"\",_xlfn.XLOOKUP('Risicolegger landbouw'!E41,'Grenswaarden landbouw'!$B$22:$B$32,'Grenswaarden landbouw'!$C$22:$C$32),\"\")","v":""},{"$f":"IF(F41<>\"\",_xlfn.XLOOKUP('Risicolegger landbouw'!F41,'Grenswaarden landbouw'!$B$22:$B$32,'Grenswaarden landbouw'!$C$22:$C$32),\"\")","v":""},{"$f":"IF(G41<>\"\",_xlfn.XLOOKUP('Risicolegger landbouw'!G41,'Grenswaarden landbouw'!$B$22:$B$32,'Grenswaarden landbouw'!$C$22:$C$32),\"\")","v":""},{"$f":"IF(H41<>\"\",_xlfn.XLOOKUP('Risicolegger landbouw'!H41,'Grenswaarden landbouw'!$B$22:$B$32,'Grenswaarden landbouw'!$C$22:$C$32),\"\")","v":""},{"$f":"IF(I41<>\"\",_xlfn.XLOOKUP('Risicolegger landbouw'!I41,'Grenswaarden landbouw'!$B$22:$B$32,'Grenswaarden landbouw'!$C$22:$C$32),\"\")","v":""},{"$f":"IF(J41<>\"\",_xlfn.XLOOKUP('Risicolegger landbouw'!J41,'Grenswaarden landbouw'!$B$22:$B$32,'Grenswaarden landbouw'!$C$22:$C$32),\"\")","v":""},{"$f":"IF(K41<>\"\",_xlfn.XLOOKUP('Risicolegger landbouw'!K41,'Grenswaarden landbouw'!$B$22:$B$32,'Grenswaarden landbouw'!$C$22:$C$32),\"\")","v":""},{"$f":"IF(L41<>\"\",_xlfn.XLOOKUP('Risicolegger landbouw'!L41,'Grenswaarden landbouw'!$B$22:$B$32,'Grenswaarden landbouw'!$C$22:$C$32),\"\")","v":""},{"$f":"IF(M41<>\"\",_xlfn.XLOOKUP('Risicolegger landbouw'!M41,'Grenswaarden landbouw'!$B$22:$B$32,'Grenswaarden landbouw'!$C$22:$C$32),\"\")","v":""},{"$f":"IF(N41<>\"\",_xlfn.XLOOKUP('Risicolegger landbouw'!N41,'Grenswaarden landbouw'!$B$22:$B$32,'Grenswaarden landbouw'!$C$22:$C$32),\"\")","v":""}]
[null,null,"Tijdens de kiemfase",{"$f":"IF(D41<>\"\",IFERROR(_xlfn.XLOOKUP('Risicolegger landbouw'!D41,'Grenswaarden landbouw'!$B$22:$B$32,'Grenswaarden landbouw'!$D$22:$D$32),\"onbekend\"),\"\")","v":"onbekend"},{"$f":"IF(E41<>\"\",_xlfn.XLOOKUP('Risicolegger landbouw'!E41,'Grenswaarden landbouw'!$B$22:$B$32,'Grenswaarden landbouw'!$D$22:$D$32),\"\")","v":""},{"$f":"IF(F41<>\"\",_xlfn.XLOOKUP('Risicolegger landbouw'!F41,'Grenswaarden landbouw'!$B$22:$B$32,'Grenswaarden landbouw'!$D$22:$D$32),\"\")","v":""},{"$f":"IF(G41<>\"\",_xlfn.XLOOKUP('Risicolegger landbouw'!G41,'Grenswaarden landbouw'!$B$22:$B$32,'Grenswaarden landbouw'!$D$22:$D$32),\"\")","v":""},{"$f":"IF(H41<>\"\",_xlfn.XLOOKUP('Risicolegger landbouw'!H41,'Grenswaarden landbouw'!$B$22:$B$32,'Grenswaarden landbouw'!$D$22:$D$32),\"\")","v":""},{"$f":"IF(I41<>\"\",_xlfn.XLOOKUP('Risicolegger landbouw'!I41,'Grenswaarden landbouw'!$B$22:$B$32,'Grenswaarden landbouw'!$D$22:$D$32),\"\")","v":""},{"$f":"IF(J41<>\"\",_xlfn.XLOOKUP('Risicolegger landbouw'!J41,'Grenswaarden landbouw'!$B$22:$B$32,'Grenswaarden landbouw'!$D$22:$D$32),\"\")","v":""},{"$f":"IF(K41<>\"\",_xlfn.XLOOKUP('Risicolegger landbouw'!K41,'Grenswaarden landbouw'!$B$22:$B$32,'Grenswaarden landbouw'!$D$22:$D$32),\"\")","v":""},{"$f":"IF(L41<>\"\",_xlfn.XLOOKUP('Risicolegger landbouw'!L41,'Grenswaarden landbouw'!$B$22:$B$32,'Grenswaarden landbouw'!$D$22:$D$32),\"\")","v":""},{"$f":"IF(M41<>\"\",_xlfn.XLOOKUP('Risicolegger landbouw'!M41,'Grenswaarden landbouw'!$B$22:$B$32,'Grenswaarden landbouw'!$D$22:$D$32),\"\")","v":""},{"$f":"IF(N41<>\"\",_xlfn.XLOOKUP('Risicolegger landbouw'!N41,'Grenswaarden landbouw'!$B$22:$B$32,'Grenswaarden landbouw'!$D$22:$D$32),\"\")","v":""}]
[null,null,"Tijdens de zaailingfase",{"$f":"IF(D41<>\"\",IFERROR(_xlfn.XLOOKUP('Risicolegger landbouw'!D41,'Grenswaarden landbouw'!$B$22:$B$32,'Grenswaarden landbouw'!$E$22:$E$32),\"onbekend\"),\"\")","v":"onbekend"},{"$f":"IF(E41<>\"\",_xlfn.XLOOKUP('Risicolegger landbouw'!E41,'Grenswaarden landbouw'!$B$22:$B$32,'Grenswaarden landbouw'!$E$22:$E$32),\"\")","v":""},{"$f":"IF(F41<>\"\",_xlfn.XLOOKUP('Risicolegger landbouw'!F41,'Grenswaarden landbouw'!$B$22:$B$32,'Grenswaarden landbouw'!$E$22:$E$32),\"\")","v":""},{"$f":"IF(G41<>\"\",_xlfn.XLOOKUP('Risicolegger landbouw'!G41,'Grenswaarden landbouw'!$B$22:$B$32,'Grenswaarden landbouw'!$E$22:$E$32),\"\")","v":""},{"$f":"IF(H41<>\"\",_xlfn.XLOOKUP('Risicolegger landbouw'!H41,'Grenswaarden landbouw'!$B$22:$B$32,'Grenswaarden landbouw'!$E$22:$E$32),\"\")","v":""},{"$f":"IF(I41<>\"\",_xlfn.XLOOKUP('Risicolegger landbouw'!I41,'Grenswaarden landbouw'!$B$22:$B$32,'Grenswaarden landbouw'!$E$22:$E$32),\"\")","v":""},{"$f":"IF(J41<>\"\",_xlfn.XLOOKUP('Risicolegger landbouw'!J41,'Grenswaarden landbouw'!$B$22:$B$32,'Grenswaarden landbouw'!$E$22:$E$32),\"\")","v":""},{"$f":"IF(K41<>\"\",_xlfn.XLOOKUP('Risicolegger landbouw'!K41,'Grenswaarden landbouw'!$B$22:$B$32,'Grenswaarden landbouw'!$E$22:$E$32),\"\")","v":""},{"$f":"IF(L41<>\"\",_xlfn.XLOOKUP('Risicolegger landbouw'!L41,'Grenswaarden landbouw'!$B$22:$B$32,'Grenswaarden landbouw'!$E$22:$E$32),\"\")","v":""},{"$f":"IF(M41<>\"\",_xlfn.XLOOKUP('Risicolegger landbouw'!M41,'Grenswaarden landbouw'!$B$22:$B$32,'Grenswaarden landbouw'!$E$22:$E$32),\"\")","v":""},{"$f":"IF(N41<>\"\",_xlfn.XLOOKUP('Risicolegger landbouw'!N41,'Grenswaarden landbouw'!$B$22:$B$32,'Grenswaarden landbouw'!$E$22:$E$32),\"\")","v":""}]
[null,null,"Tijdens de vegetatieve groei",{"$f":"IF(D41<>\"\",IFERROR(_xlfn.XLOOKUP('Risicolegger landbouw'!D41,'Grenswaarden landbouw'!$B$22:$B$32,'Grenswaarden landbouw'!$F$22:$F$32),\"onbekend\"),\"\")","v":"onbekend"},{"$f":"IF(E41<>\"\",_xlfn.XLOOKUP('Risicolegger landbouw'!E41,'Grenswaarden landbouw'!$B$22:$B$32,'Grenswaarden landbouw'!$F$22:$F$32),\"\")","v":""},{"$f":"IF(F41<>\"\",_xlfn.XLOOKUP('Risicolegger landbouw'!F41,'Grenswaarden landbouw'!$B$22:$B$32,'Grenswaarden landbouw'!$F$22:$F$32),\"\")","v":""},{"$f":"IF(G41<>\"\",_xlfn.XLOOKUP('Risicolegger landbouw'!G41,'Grenswaarden landbouw'!$B$22:$B$32,'Grenswaarden landbouw'!$F$22:$F$32),\"\")","v":""},{"$f":"IF(H41<>\"\",_xlfn.XLOOKUP('Risicolegger landbouw'!H41,'Grenswaarden landbouw'!$B$22:$B$32,'Grenswaarden landbouw'!$F$22:$F$32),\"\")","v":""},{"$f":"IF(I41<>\"\",_xlfn.XLOOKUP('Risicolegger landbouw'!I41,'Grenswaarden landbouw'!$B$22:$B$32,'Grenswaarden landbouw'!$F$22:$F$32),\"\")","v":""},{"$f":"IF(J41<>\"\",_xlfn.XLOOKUP('Risicolegger landbouw'!J41,'Grenswaarden landbouw'!$B$22:$B$32,'Grenswaarden landbouw'!$F$22:$F$32),\"\")","v":""},{"$f":"IF(K41<>\"\",_xlfn.XLOOKUP('Risicolegger landbouw'!K41,'Grenswaarden landbouw'!$B$22:$B$32,'Grenswaarden landbouw'!$F$22:$F$32),\"\")","v":""},{"$f":"IF(L41<>\"\",_xlfn.XLOOKUP('Risicolegger landbouw'!L41,'Grenswaarden landbouw'!$B$22:$B$32,'Grenswaarden landbouw'!$F$22:$F$32),\"\")","v":""},{"$f":"IF(M41<>\"\",_xlfn.XLOOKUP('Risicolegger landbouw'!M41,'Grenswaarden landbouw'!$B$22:$B$32,'Grenswaarden landbouw'!$F$22:$F$32),\"\")","v":""},{"$f":"IF(N41<>\"\",_xlfn.XLOOKUP('Risicolegger landbouw'!N41,'Grenswaarden landbouw'!$B$22:$B$32,'Grenswaarden landbouw'!$F$22:$F$32),\"\")","v":""}]
[null,null,"Tijdens de oogst",{"$f":"IF(D41<>\"\",IFERROR(_xlfn.XLOOKUP('Risicolegger landbouw'!D41,'Grenswaarden landbouw'!$B$22:$B$32,'Grenswaarden landbouw'!$G$22:$G$32),\"onbekend\"),\"\")","v":"onbekend"},{"$f":"IF(E41<>\"\",_xlfn.XLOOKUP('Risicolegger landbouw'!E41,'Grenswaarden landbouw'!$B$22:$B$32,'Grenswaarden landbouw'!$G$22:$G$32),\"\")","v":""},{"$f":"IF(F41<>\"\",_xlfn.XLOOKUP('Risicolegger landbouw'!F41,'Grenswaarden landbouw'!$B$22:$B$32,'Grenswaarden landbouw'!$G$22:$G$32),\"\")","v":""},{"$f":"IF(G41<>\"\",_xlfn.XLOOKUP('Risicolegger landbouw'!G41,'Grenswaarden landbouw'!$B$22:$B$32,'Grenswaarden landbouw'!$G$22:$G$32),\"\")","v":""},{"$f":"IF(H41<>\"\",_xlfn.XLOOKUP('Risicolegger landbouw'!H41,'Grenswaarden landbouw'!$B$22:$B$32,'Grenswaarden landbouw'!$G$22:$G$32),\"\")","v":""},{"$f":"IF(I41<>\"\",_xlfn.XLOOKUP('Risicolegger landbouw'!I41,'Grenswaarden landbouw'!$B$22:$B$32,'Grenswaarden landbouw'!$G$22:$G$32),\"\")","v":""},{"$f":"IF(J41<>\"\",_xlfn.XLOOKUP('Risicolegger landbouw'!J41,'Grenswaarden landbouw'!$B$22:$B$32,'Grenswaarden landbouw'!$G$22:$G$32),\"\")","v":""},{"$f":"IF(K41<>\"\",_xlfn.XLOOKUP('Risicolegger landbouw'!K41,'Grenswaarden landbouw'!$B$22:$B$32,'Grenswaarden landbouw'!$G$22:$G$32),\"\")","v":""},{"$f":"IF(L41<>\"\",_xlfn.XLOOKUP('Risicolegger landbouw'!L41,'Grenswaarden landbouw'!$B$22:$B$32,'Grenswaarden landbouw'!$G$22:$G$32),\"\")","v":""},{"$f":"IF(M41<>\"\",_xlfn.XLOOKUP('Risicolegger landbouw'!M41,'Grenswaarden landbouw'!$B$22:$B$32,'Grenswaarden landbouw'!$G$22:$G$32),\"\")","v":""},{"$f":"IF(N41<>\"\",_xlfn.XLOOKUP('Risicolegger landbouw'!N41,'Grenswaarden landbouw'!$B$22:$B$32,'Grenswaarden landbouw'!$G$22:$G$32),\"\")","v":""}]
[]
[null,null,{"$f":"IF(eenheid_zoutgehalte_landbouw_huidig=Invoer!$H$4, \"Kwantitatieve zouttolerantie (in dS/m)\", IF(eenheid_zoutgehalte_landbouw_huidig=Invoer!$H$5,\"Kwantitatieve zouttolerantie (in mgCl/l)\",\"Kwantitatieve zouttolerantie\"))","v":"Kwantitatieve zouttolerantie"},"Normaal"]
[null,null,"Dit wordt bepaald o.b.v. het bodemtype en de kwalitatieve zouttolerantie, o.b.v. een deskundigenoordeel van The Salt Doctors. "]
[null,null,"Algemeen voor het doelgewas",{"$f":"IF(D$41<>\"\", IF(D$41=\"geen selectie gemaakt\",\"-\",\n    IF('1. Algemeen'!$K$18<>\"\",\n       IF($R$38=0, \"-\",\n          _xlfn.XLOOKUP(1,\n              ('Grenswaarden landbouw'!$B$4:$B$18='1. Algemeen'!$K$18) * ('Grenswaarden landbouw'!$C$4:$C$18='Risicolegger landbouw'!D45),\n              IF($R$38=1, 'Grenswaarden landbouw'!$D$4:$D$18,\n                 IF($R$38=2, 'Grenswaarden landbouw'!$E$4:$E$18)),\n          \"n.v.t.\")),\n    \"\")),\n\"\")","v":"-"},{"$f":"IF(E$41<>\"\", IF(E$41=\"geen selectie gemaakt\",\"-\",\n    IF('1. Algemeen'!$K$18<>\"\",\n       IF($R$38=0, \"-\",\n          _xlfn.XLOOKUP(1,\n              ('Grenswaarden landbouw'!$B$4:$B$18='1. Algemeen'!$K$18) * ('Grenswaarden landbouw'!$C$4:$C$18='Risicolegger landbouw'!E45),\n              IF($R$38=1, 'Grenswaarden landbouw'!$D$4:$D$18,\n                 IF($R$38=2, 'Grenswaarden landbouw'!$E$4:$E$18)),\n          \"n.v.t.\")),\n    \"\")),\n\"\")","v":""},{"$f":"IF(F$41<>\"\", IF(F$41=\"geen selectie gemaakt\",\"-\",\n    IF('1. Algemeen'!$K$18<>\"\",\n       IF($R$38=0, \"-\",\n          _xlfn.XLOOKUP(1,\n              ('Grenswaarden landbouw'!$B$4:$B$18='1. Algemeen'!$K$18) * ('Grenswaarden landbouw'!$C$4:$C$18='Risicolegger landbouw'!F45),\n              IF($R$38=1, 'Grenswaarden landbouw'!$D$4:$D$18,\n                 IF($R$38=2, 'Grenswaarden landbouw'!$E$4:$E$18)),\n          \"n.v.t.\")),\n    \"\")),\n\"\")","v":""},{"$f":"IF(G$41<>\"\", IF(G$41=\"geen selectie gemaakt\",\"-\",\n    IF('1. Algemeen'!$K$18<>\"\",\n       IF($R$38=0, \"-\",\n          _xlfn.XLOOKUP(1,\n              ('Grenswaarden landbouw'!$B$4:$B$18='1. Algemeen'!$K$18) * ('Grenswaarden landbouw'!$C$4:$C$18='Risicolegger landbouw'!G45),\n              IF($R$38=1, 'Grenswaarden landbouw'!$D$4:$D$18,\n                 IF($R$38=2, 'Grenswaarden landbouw'!$E$4:$E$18)),\n          \"n.v.t.\")),\n    \"\")),\n\"\")","v":""},{"$f":"IF(H$41<>\"\", IF(H$41=\"geen selectie gemaakt\",\"-\",\n    IF('1. Algemeen'!$K$18<>\"\",\n       IF($R$38=0, \"-\",\n          _xlfn.XLOOKUP(1,\n              ('Grenswaarden landbouw'!$B$4:$B$18='1. Algemeen'!$K$18) * ('Grenswaarden landbouw'!$C$4:$C$18='Risicolegger landbouw'!H45),\n              IF($R$38=1, 'Grenswaarden landbouw'!$D$4:$D$18,\n                 IF($R$38=2, 'Grenswaarden landbouw'!$E$4:$E$18)),\n          \"n.v.t.\")),\n    \"\")),\n\"\")","v":""},{"$f":"IF(I$41<>\"\", IF(I$41=\"geen selectie gemaakt\",\"-\",\n    IF('1. Algemeen'!$K$18<>\"\",\n       IF($R$38=0, \"-\",\n          _xlfn.XLOOKUP(1,\n              ('Grenswaarden landbouw'!$B$4:$B$18='1. Algemeen'!$K$18) * ('Grenswaarden landbouw'!$C$4:$C$18='Risicolegger landbouw'!I45),\n              IF($R$38=1, 'Grenswaarden landbouw'!$D$4:$D$18,\n                 IF($R$38=2, 'Grenswaarden landbouw'!$E$4:$E$18)),\n          \"n.v.t.\")),\n    \"\")),\n\"\")","v":""},{"$f":"IF(J$41<>\"\", IF(J$41=\"geen selectie gemaakt\",\"-\",\n    IF('1. Algemeen'!$K$18<>\"\",\n       IF($R$38=0, \"-\",\n          _xlfn.XLOOKUP(1,\n              ('Grenswaarden landbouw'!$B$4:$B$18='1. Algemeen'!$K$18) * ('Grenswaarden landbouw'!$C$4:$C$18='Risicolegger landbouw'!J45),\n              IF($R$38=1, 'Grenswaarden landbouw'!$D$4:$D$18,\n                 IF($R$38=2, 'Grenswaarden landbouw'!$E$4:$E$18)),\n          \"n.v.t.\")),\n    \"\")),\n\"\")","v":""},{"$f":"IF(K$41<>\"\", IF(K$41=\"geen selectie gemaakt\",\"-\",\n    IF('1. Algemeen'!$K$18<>\"\",\n       IF($R$38=0, \"-\",\n          _xlfn.XLOOKUP(1,\n              ('Grenswaarden landbouw'!$B$4:$B$18='1. Algemeen'!$K$18) * ('Grenswaarden landbouw'!$C$4:$C$18='Risicolegger landbouw'!K45),\n              IF($R$38=1, 'Grenswaarden landbouw'!$D$4:$D$18,\n                 IF($R$38=2, 'Grenswaarden landbouw'!$E$4:$E$18)),\n          \"n.v.t.\")),\n    \"\")),\n\"\")","v":""},{"$f":"IF(L$41<>\"\", IF(L$41=\"geen selectie gemaakt\",\"-\",\n    IF('1. Algemeen'!$K$18<>\"\",\n       IF($R$38=0, \"-\",\n          _xlfn.XLOOKUP(1,\n              ('Grenswaarden landbouw'!$B$4:$B$18='1. Algemeen'!$K$18) * ('Grenswaarden landbouw'!$C$4:$C$18='Risicolegger landbouw'!L45),\n              IF($R$38=1, 'Grenswaarden landbouw'!$D$4:$D$18,\n                 IF($R$38=2, 'Grenswaarden landbouw'!$E$4:$E$18)),\n          \"n.v.t.\")),\n    \"\")),\n\"\")","v":""},{"$f":"IF(M$41<>\"\", IF(M$41=\"geen selectie gemaakt\",\"-\",\n    IF('1. Algemeen'!$K$18<>\"\",\n       IF($R$38=0, \"-\",\n          _xlfn.XLOOKUP(1,\n              ('Grenswaarden landbouw'!$B$4:$B$18='1. Algemeen'!$K$18) * ('Grenswaarden landbouw'!$C$4:$C$18='Risicolegger landbouw'!M45),\n              IF($R$38=1, 'Grenswaarden landbouw'!$D$4:$D$18,\n                 IF($R$38=2, 'Grenswaarden landbouw'!$E$4:$E$18)),\n          \"n.v.t.\")),\n    \"\")),\n\"\")","v":""},{"$f":"IF(N$41<>\"\", IF(N$41=\"geen selectie gemaakt\",\"-\",\n    IF('1. Algemeen'!$K$18<>\"\",\n       IF($R$38=0, \"-\",\n          _xlfn.XLOOKUP(1,\n              ('Grenswaarden landbouw'!$B$4:$B$18='1. Algemeen'!$K$18) * ('Grenswaarden landbouw'!$C$4:$C$18='Risicolegger landbouw'!N45),\n              IF($R$38=1, 'Grenswaarden landbouw'!$D$4:$D$18,\n                 IF($R$38=2, 'Grenswaarden landbouw'!$E$4:$E$18)),\n          \"n.v.t.\")),\n    \"\")),\n\"\")","v":""}]
[null,null,"Tijdens de kiemfase",{"$f":"IF(D$41<>\"\", IF(D$41=\"geen selectie gemaakt\",\"-\",\n    IF('1. Algemeen'!$K$18<>\"\",\n       IF($R$38=0, \"-\",\n          _xlfn.XLOOKUP(1,\n              ('Grenswaarden landbouw'!$B$4:$B$18='1. Algemeen'!$K$18) * ('Grenswaarden landbouw'!$C$4:$C$18='Risicolegger landbouw'!D46),\n              IF($R$38=1, 'Grenswaarden landbouw'!$D$4:$D$18,\n                 IF($R$38=2, 'Grenswaarden landbouw'!$E$4:$E$18)),\n          \"n.v.t.\")),\n    \"\")),\n\"\")","v":"-"},{"$f":"IF(E$41<>\"\", IF(E$41=\"geen selectie gemaakt\",\"-\",\n    IF('1. Algemeen'!$K$18<>\"\",\n       IF($R$38=0, \"-\",\n          _xlfn.XLOOKUP(1,\n              ('Grenswaarden landbouw'!$B$4:$B$18='1. Algemeen'!$K$18) * ('Grenswaarden landbouw'!$C$4:$C$18='Risicolegger landbouw'!E46),\n              IF($R$38=1, 'Grenswaarden landbouw'!$D$4:$D$18,\n                 IF($R$38=2, 'Grenswaarden landbouw'!$E$4:$E$18)),\n          \"n.v.t.\")),\n    \"\")),\n\"\")","v":""},{"$f":"IF(F$41<>\"\", IF(F$41=\"geen selectie gemaakt\",\"-\",\n    IF('1. Algemeen'!$K$18<>\"\",\n       IF($R$38=0, \"-\",\n          _xlfn.XLOOKUP(1,\n              ('Grenswaarden landbouw'!$B$4:$B$18='1. Algemeen'!$K$18) * ('Grenswaarden landbouw'!$C$4:$C$18='Risicolegger landbouw'!F46),\n              IF($R$38=1, 'Grenswaarden landbouw'!$D$4:$D$18,\n                 IF($R$38=2, 'Grenswaarden landbouw'!$E$4:$E$18)),\n          \"n.v.t.\")),\n    \"\")),\n\"\")","v":""},{"$f":"IF(G$41<>\"\", IF(G$41=\"geen selectie gemaakt\",\"-\",\n    IF('1. Algemeen'!$K$18<>\"\",\n       IF($R$38=0, \"-\",\n          _xlfn.XLOOKUP(1,\n              ('Grenswaarden landbouw'!$B$4:$B$18='1. Algemeen'!$K$18) * ('Grenswaarden landbouw'!$C$4:$C$18='Risicolegger landbouw'!G46),\n              IF($R$38=1, 'Grenswaarden landbouw'!$D$4:$D$18,\n                 IF($R$38=2, 'Grenswaarden landbouw'!$E$4:$E$18)),\n          \"n.v.t.\")),\n    \"\")),\n\"\")","v":""},{"$f":"IF(H$41<>\"\", IF(H$41=\"geen selectie gemaakt\",\"-\",\n    IF('1. Algemeen'!$K$18<>\"\",\n       IF($R$38=0, \"-\",\n          _xlfn.XLOOKUP(1,\n              ('Grenswaarden landbouw'!$B$4:$B$18='1. Algemeen'!$K$18) * ('Grenswaarden landbouw'!$C$4:$C$18='Risicolegger landbouw'!H46),\n              IF($R$38=1, 'Grenswaarden landbouw'!$D$4:$D$18,\n                 IF($R$38=2, 'Grenswaarden landbouw'!$E$4:$E$18)),\n          \"n.v.t.\")),\n    \"\")),\n\"\")","v":""},{"$f":"IF(I$41<>\"\", IF(I$41=\"geen selectie gemaakt\",\"-\",\n    IF('1. Algemeen'!$K$18<>\"\",\n       IF($R$38=0, \"-\",\n          _xlfn.XLOOKUP(1,\n              ('Grenswaarden landbouw'!$B$4:$B$18='1. Algemeen'!$K$18) * ('Grenswaarden landbouw'!$C$4:$C$18='Risicolegger landbouw'!I46),\n              IF($R$38=1, 'Grenswaarden landbouw'!$D$4:$D$18,\n                 IF($R$38=2, 'Grenswaarden landbouw'!$E$4:$E$18)),\n          \"n.v.t.\")),\n    \"\")),\n\"\")","v":""},{"$f":"IF(J$41<>\"\", IF(J$41=\"geen selectie gemaakt\",\"-\",\n    IF('1. Algemeen'!$K$18<>\"\",\n       IF($R$38=0, \"-\",\n          _xlfn.XLOOKUP(1,\n              ('Grenswaarden landbouw'!$B$4:$B$18='1. Algemeen'!$K$18) * ('Grenswaarden landbouw'!$C$4:$C$18='Risicolegger landbouw'!J46),\n              IF($R$38=1, 'Grenswaarden landbouw'!$D$4:$D$18,\n                 IF($R$38=2, 'Grenswaarden landbouw'!$E$4:$E$18)),\n          \"n.v.t.\")),\n    \"\")),\n\"\")","v":""},{"$f":"IF(K$41<>\"\", IF(K$41=\"geen selectie gemaakt\",\"-\",\n    IF('1. Algemeen'!$K$18<>\"\",\n       IF($R$38=0, \"-\",\n          _xlfn.XLOOKUP(1,\n              ('Grenswaarden landbouw'!$B$4:$B$18='1. Algemeen'!$K$18) * ('Grenswaarden landbouw'!$C$4:$C$18='Risicolegger landbouw'!K46),\n              IF($R$38=1, 'Grenswaarden landbouw'!$D$4:$D$18,\n                 IF($R$38=2, 'Grenswaarden landbouw'!$E$4:$E$18)),\n          \"n.v.t.\")),\n    \"\")),\n\"\")","v":""},{"$f":"IF(L$41<>\"\", IF(L$41=\"geen selectie gemaakt\",\"-\",\n    IF('1. Algemeen'!$K$18<>\"\",\n       IF($R$38=0, \"-\",\n          _xlfn.XLOOKUP(1,\n              ('Grenswaarden landbouw'!$B$4:$B$18='1. Algemeen'!$K$18) * ('Grenswaarden landbouw'!$C$4:$C$18='Risicolegger landbouw'!L46),\n              IF($R$38=1, 'Grenswaarden landbouw'!$D$4:$D$18,\n                 IF($R$38=2, 'Grenswaarden landbouw'!$E$4:$E$18)),\n          \"n.v.t.\")),\n    \"\")),\n\"\")","v":""},{"$f":"IF(M$41<>\"\", IF(M$41=\"geen selectie gemaakt\",\"-\",\n    IF('1. Algemeen'!$K$18<>\"\",\n       IF($R$38=0, \"-\",\n          _xlfn.XLOOKUP(1,\n              ('Grenswaarden landbouw'!$B$4:$B$18='1. Algemeen'!$K$18) * ('Grenswaarden landbouw'!$C$4:$C$18='Risicolegger landbouw'!M46),\n              IF($R$38=1, 'Grenswaarden landbouw'!$D$4:$D$18,\n                 IF($R$38=2, 'Grenswaarden landbouw'!$E$4:$E$18)),\n          \"n.v.t.\")),\n    \"\")),\n\"\")","v":""},{"$f":"IF(N$41<>\"\", IF(N$41=\"geen selectie gemaakt\",\"-\",\n    IF('1. Algemeen'!$K$18<>\"\",\n       IF($R$38=0, \"-\",\n          _xlfn.XLOOKUP(1,\n              ('Grenswaarden landbouw'!$B$4:$B$18='1. Algemeen'!$K$18) * ('Grenswaarden landbouw'!$C$4:$C$18='Risicolegger landbouw'!N46),\n              IF($R$38=1, 'Grenswaarden landbouw'!$D$4:$D$18,\n                 IF($R$38=2, 'Grenswaarden landbouw'!$E$4:$E$18)),\n          \"n.v.t.\")),\n    \"\")),\n\"\")","v":""}]
[null,null,"Tijdens de zaailingfase",{"$f":"IF(D$41<>\"\", IF(D$41=\"geen selectie gemaakt\",\"-\",\n    IF('1. Algemeen'!$K$18<>\"\",\n       IF($R$38=0, \"-\",\n          _xlfn.XLOOKUP(1,\n              ('Grenswaarden landbouw'!$B$4:$B$18='1. Algemeen'!$K$18) * ('Grenswaarden landbouw'!$C$4:$C$18='Risicolegger landbouw'!D47),\n              IF($R$38=1, 'Grenswaarden landbouw'!$D$4:$D$18,\n                 IF($R$38=2, 'Grenswaarden landbouw'!$E$4:$E$18)),\n          \"n.v.t.\")),\n    \"\")),\n\"\")","v":"-"},{"$f":"IF(E$41<>\"\", IF(E$41=\"geen selectie gemaakt\",\"-\",\n    IF('1. Algemeen'!$K$18<>\"\",\n       IF($R$38=0, \"-\",\n          _xlfn.XLOOKUP(1,\n              ('Grenswaarden landbouw'!$B$4:$B$18='1. Algemeen'!$K$18) * ('Grenswaarden landbouw'!$C$4:$C$18='Risicolegger landbouw'!E47),\n              IF($R$38=1, 'Grenswaarden landbouw'!$D$4:$D$18,\n                 IF($R$38=2, 'Grenswaarden landbouw'!$E$4:$E$18)),\n          \"n.v.t.\")),\n    \"\")),\n\"\")","v":""},{"$f":"IF(F$41<>\"\", IF(F$41=\"geen selectie gemaakt\",\"-\",\n    IF('1. Algemeen'!$K$18<>\"\",\n       IF($R$38=0, \"-\",\n          _xlfn.XLOOKUP(1,\n              ('Grenswaarden landbouw'!$B$4:$B$18='1. Algemeen'!$K$18) * ('Grenswaarden landbouw'!$C$4:$C$18='Risicolegger landbouw'!F47),\n              IF($R$38=1, 'Grenswaarden landbouw'!$D$4:$D$18,\n                 IF($R$38=2, 'Grenswaarden landbouw'!$E$4:$E$18)),\n          \"n.v.t.\")),\n    \"\")),\n\"\")","v":""},{"$f":"IF(G$41<>\"\", IF(G$41=\"geen selectie gemaakt\",\"-\",\n    IF('1. Algemeen'!$K$18<>\"\",\n       IF($R$38=0, \"-\",\n          _xlfn.XLOOKUP(1,\n              ('Grenswaarden landbouw'!$B$4:$B$18='1. Algemeen'!$K$18) * ('Grenswaarden landbouw'!$C$4:$C$18='Risicolegger landbouw'!G47),\n              IF($R$38=1, 'Grenswaarden landbouw'!$D$4:$D$18,\n                 IF($R$38=2, 'Grenswaarden landbouw'!$E$4:$E$18)),\n          \"n.v.t.\")),\n    \"\")),\n\"\")","v":""},{"$f":"IF(H$41<>\"\", IF(H$41=\"geen selectie gemaakt\",\"-\",\n    IF('1. Algemeen'!$K$18<>\"\",\n       IF($R$38=0, \"-\",\n          _xlfn.XLOOKUP(1,\n              ('Grenswaarden landbouw'!$B$4:$B$18='1. Algemeen'!$K$18) * ('Grenswaarden landbouw'!$C$4:$C$18='Risicolegger landbouw'!H47),\n              IF($R$38=1, 'Grenswaarden landbouw'!$D$4:$D$18,\n                 IF($R$38=2, 'Grenswaarden landbouw'!$E$4:$E$18)),\n          \"n.v.t.\")),\n    \"\")),\n\"\")","v":""},{"$f":"IF(I$41<>\"\", IF(I$41=\"geen selectie gemaakt\",\"-\",\n    IF('1. Algemeen'!$K$18<>\"\",\n       IF($R$38=0, \"-\",\n          _xlfn.XLOOKUP(1,\n              ('Grenswaarden landbouw'!$B$4:$B$18='1. Algemeen'!$K$18) * ('Grenswaarden landbouw'!$C$4:$C$18='Risicolegger landbouw'!I47),\n              IF($R$38=1, 'Grenswaarden landbouw'!$D$4:$D$18,\n                 IF($R$38=2, 'Grenswaarden landbouw'!$E$4:$E$18)),\n          \"n.v.t.\")),\n    \"\")),\n\"\")","v":""},{"$f":"IF(J$41<>\"\", IF(J$41=\"geen selectie gemaakt\",\"-\",\n    IF('1. Algemeen'!$K$18<>\"\",\n       IF($R$38=0, \"-\",\n          _xlfn.XLOOKUP(1,\n              ('Grenswaarden landbouw'!$B$4:$B$18='1. Algemeen'!$K$18) * ('Grenswaarden landbouw'!$C$4:$C$18='Risicolegger landbouw'!J47),\n              IF($R$38=1, 'Grenswaarden landbouw'!$D$4:$D$18,\n                 IF($R$38=2, 'Grenswaarden landbouw'!$E$4:$E$18)),\n          \"n.v.t.\")),\n    \"\")),\n\"\")","v":""},{"$f":"IF(K$41<>\"\", IF(K$41=\"geen selectie gemaakt\",\"-\",\n    IF('1. Algemeen'!$K$18<>\"\",\n       IF($R$38=0, \"-\",\n          _xlfn.XLOOKUP(1,\n              ('Grenswaarden landbouw'!$B$4:$B$18='1. Algemeen'!$K$18) * ('Grenswaarden landbouw'!$C$4:$C$18='Risicolegger landbouw'!K47),\n              IF($R$38=1, 'Grenswaarden landbouw'!$D$4:$D$18,\n                 IF($R$38=2, 'Grenswaarden landbouw'!$E$4:$E$18)),\n          \"n.v.t.\")),\n    \"\")),\n\"\")","v":""},{"$f":"IF(L$41<>\"\", IF(L$41=\"geen selectie gemaakt\",\"-\",\n    IF('1. Algemeen'!$K$18<>\"\",\n       IF($R$38=0, \"-\",\n          _xlfn.XLOOKUP(1,\n              ('Grenswaarden landbouw'!$B$4:$B$18='1. Algemeen'!$K$18) * ('Grenswaarden landbouw'!$C$4:$C$18='Risicolegger landbouw'!L47),\n              IF($R$38=1, 'Grenswaarden landbouw'!$D$4:$D$18,\n                 IF($R$38=2, 'Grenswaarden landbouw'!$E$4:$E$18)),\n          \"n.v.t.\")),\n    \"\")),\n\"\")","v":""},{"$f":"IF(M$41<>\"\", IF(M$41=\"geen selectie gemaakt\",\"-\",\n    IF('1. Algemeen'!$K$18<>\"\",\n       IF($R$38=0, \"-\",\n          _xlfn.XLOOKUP(1,\n              ('Grenswaarden landbouw'!$B$4:$B$18='1. Algemeen'!$K$18) * ('Grenswaarden landbouw'!$C$4:$C$18='Risicolegger landbouw'!M47),\n              IF($R$38=1, 'Grenswaarden landbouw'!$D$4:$D$18,\n                 IF($R$38=2, 'Grenswaarden landbouw'!$E$4:$E$18)),\n          \"n.v.t.\")),\n    \"\")),\n\"\")","v":""},{"$f":"IF(N$41<>\"\", IF(N$41=\"geen selectie gemaakt\",\"-\",\n    IF('1. Algemeen'!$K$18<>\"\",\n       IF($R$38=0, \"-\",\n          _xlfn.XLOOKUP(1,\n              ('Grenswaarden landbouw'!$B$4:$B$18='1. Algemeen'!$K$18) * ('Grenswaarden landbouw'!$C$4:$C$18='Risicolegger landbouw'!N47),\n              IF($R$38=1, 'Grenswaarden landbouw'!$D$4:$D$18,\n                 IF($R$38=2, 'Grenswaarden landbouw'!$E$4:$E$18)),\n          \"n.v.t.\")),\n    \"\")),\n\"\")","v":""}]
[null,null,"Tijdens de vegetatieve groei",{"$f":"IF(D$41<>\"\", IF(D$41=\"geen selectie gemaakt\",\"-\",\n    IF('1. Algemeen'!$K$18<>\"\",\n       IF($R$38=0, \"-\",\n          _xlfn.XLOOKUP(1,\n              ('Grenswaarden landbouw'!$B$4:$B$18='1. Algemeen'!$K$18) * ('Grenswaarden landbouw'!$C$4:$C$18='Risicolegger landbouw'!D48),\n              IF($R$38=1, 'Grenswaarden landbouw'!$D$4:$D$18,\n                 IF($R$38=2, 'Grenswaarden landbouw'!$E$4:$E$18)),\n          \"n.v.t.\")),\n    \"\")),\n\"\")","v":"-"},{"$f":"IF(E$41<>\"\", IF(E$41=\"geen selectie gemaakt\",\"-\",\n    IF('1. Algemeen'!$K$18<>\"\",\n       IF($R$38=0, \"-\",\n          _xlfn.XLOOKUP(1,\n              ('Grenswaarden landbouw'!$B$4:$B$18='1. Algemeen'!$K$18) * ('Grenswaarden landbouw'!$C$4:$C$18='Risicolegger landbouw'!E48),\n              IF($R$38=1, 'Grenswaarden landbouw'!$D$4:$D$18,\n                 IF($R$38=2, 'Grenswaarden landbouw'!$E$4:$E$18)),\n          \"n.v.t.\")),\n    \"\")),\n\"\")","v":""},{"$f":"IF(F$41<>\"\", IF(F$41=\"geen selectie gemaakt\",\"-\",\n    IF('1. Algemeen'!$K$18<>\"\",\n       IF($R$38=0, \"-\",\n          _xlfn.XLOOKUP(1,\n              ('Grenswaarden landbouw'!$B$4:$B$18='1. Algemeen'!$K$18) * ('Grenswaarden landbouw'!$C$4:$C$18='Risicolegger landbouw'!F48),\n              IF($R$38=1, 'Grenswaarden landbouw'!$D$4:$D$18,\n                 IF($R$38=2, 'Grenswaarden landbouw'!$E$4:$E$18)),\n          \"n.v.t.\")),\n    \"\")),\n\"\")","v":""},{"$f":"IF(G$41<>\"\", IF(G$41=\"geen selectie gemaakt\",\"-\",\n    IF('1. Algemeen'!$K$18<>\"\",\n       IF($R$38=0, \"-\",\n          _xlfn.XLOOKUP(1,\n              ('Grenswaarden landbouw'!$B$4:$B$18='1. Algemeen'!$K$18) * ('Grenswaarden landbouw'!$C$4:$C$18='Risicolegger landbouw'!G48),\n              IF($R$38=1, 'Grenswaarden landbouw'!$D$4:$D$18,\n                 IF($R$38=2, 'Grenswaarden landbouw'!$E$4:$E$18)),\n          \"n.v.t.\")),\n    \"\")),\n\"\")","v":""},{"$f":"IF(H$41<>\"\", IF(H$41=\"geen selectie gemaakt\",\"-\",\n    IF('1. Algemeen'!$K$18<>\"\",\n       IF($R$38=0, \"-\",\n          _xlfn.XLOOKUP(1,\n              ('Grenswaarden landbouw'!$B$4:$B$18='1. Algemeen'!$K$18) * ('Grenswaarden landbouw'!$C$4:$C$18='Risicolegger landbouw'!H48),\n              IF($R$38=1, 'Grenswaarden landbouw'!$D$4:$D$18,\n                 IF($R$38=2, 'Grenswaarden landbouw'!$E$4:$E$18)),\n          \"n.v.t.\")),\n    \"\")),\n\"\")","v":""},{"$f":"IF(I$41<>\"\", IF(I$41=\"geen selectie gemaakt\",\"-\",\n    IF('1. Algemeen'!$K$18<>\"\",\n       IF($R$38=0, \"-\",\n          _xlfn.XLOOKUP(1,\n              ('Grenswaarden landbouw'!$B$4:$B$18='1. Algemeen'!$K$18) * ('Grenswaarden landbouw'!$C$4:$C$18='Risicolegger landbouw'!I48),\n              IF($R$38=1, 'Grenswaarden landbouw'!$D$4:$D$18,\n                 IF($R$38=2, 'Grenswaarden landbouw'!$E$4:$E$18)),\n          \"n.v.t.\")),\n    \"\")),\n\"\")","v":""},{"$f":"IF(J$41<>\"\", IF(J$41=\"geen selectie gemaakt\",\"-\",\n    IF('1. Algemeen'!$K$18<>\"\",\n       IF($R$38=0, \"-\",\n          _xlfn.XLOOKUP(1,\n              ('Grenswaarden landbouw'!$B$4:$B$18='1. Algemeen'!$K$18) * ('Grenswaarden landbouw'!$C$4:$C$18='Risicolegger landbouw'!J48),\n              IF($R$38=1, 'Grenswaarden landbouw'!$D$4:$D$18,\n                 IF($R$38=2, 'Grenswaarden landbouw'!$E$4:$E$18)),\n          \"n.v.t.\")),\n    \"\")),\n\"\")","v":""},{"$f":"IF(K$41<>\"\", IF(K$41=\"geen selectie gemaakt\",\"-\",\n    IF('1. Algemeen'!$K$18<>\"\",\n       IF($R$38=0, \"-\",\n          _xlfn.XLOOKUP(1,\n              ('Grenswaarden landbouw'!$B$4:$B$18='1. Algemeen'!$K$18) * ('Grenswaarden landbouw'!$C$4:$C$18='Risicolegger landbouw'!K48),\n              IF($R$38=1, 'Grenswaarden landbouw'!$D$4:$D$18,\n                 IF($R$38=2, 'Grenswaarden landbouw'!$E$4:$E$18)),\n          \"n.v.t.\")),\n    \"\")),\n\"\")","v":""},{"$f":"IF(L$41<>\"\", IF(L$41=\"geen selectie gemaakt\",\"-\",\n    IF('1. Algemeen'!$K$18<>\"\",\n       IF($R$38=0, \"-\",\n          _xlfn.XLOOKUP(1,\n              ('Grenswaarden landbouw'!$B$4:$B$18='1. Algemeen'!$K$18) * ('Grenswaarden landbouw'!$C$4:$C$18='Risicolegger landbouw'!L48),\n              IF($R$38=1, 'Grenswaarden landbouw'!$D$4:$D$18,\n                 IF($R$38=2, 'Grenswaarden landbouw'!$E$4:$E$18)),\n          \"n.v.t.\")),\n    \"\")),\n\"\")","v":""},{"$f":"IF(M$41<>\"\", IF(M$41=\"geen selectie gemaakt\",\"-\",\n    IF('1. Algemeen'!$K$18<>\"\",\n       IF($R$38=0, \"-\",\n          _xlfn.XLOOKUP(1,\n              ('Grenswaarden landbouw'!$B$4:$B$18='1. Algemeen'!$K$18) * ('Grenswaarden landbouw'!$C$4:$C$18='Risicolegger landbouw'!M48),\n              IF($R$38=1, 'Grenswaarden landbouw'!$D$4:$D$18,\n                 IF($R$38=2, 'Grenswaarden landbouw'!$E$4:$E$18)),\n          \"n.v.t.\")),\n    \"\")),\n\"\")","v":""},{"$f":"IF(N$41<>\"\", IF(N$41=\"geen selectie gemaakt\",\"-\",\n    IF('1. Algemeen'!$K$18<>\"\",\n       IF($R$38=0, \"-\",\n          _xlfn.XLOOKUP(1,\n              ('Grenswaarden landbouw'!$B$4:$B$18='1. Algemeen'!$K$18) * ('Grenswaarden landbouw'!$C$4:$C$18='Risicolegger landbouw'!N48),\n              IF($R$38=1, 'Grenswaarden landbouw'!$D$4:$D$18,\n                 IF($R$38=2, 'Grenswaarden landbouw'!$E$4:$E$18)),\n          \"n.v.t.\")),\n    \"\")),\n\"\")","v":""}]
[null,null,"Tijdens de oogst",{"$f":"IF(D$41<>\"\", IF(D$41=\"geen selectie gemaakt\",\"-\",\n    IF('1. Algemeen'!$K$18<>\"\",\n       IF($R$38=0, \"-\",\n          _xlfn.XLOOKUP(1,\n              ('Grenswaarden landbouw'!$B$4:$B$18='1. Algemeen'!$K$18) * ('Grenswaarden landbouw'!$C$4:$C$18='Risicolegger landbouw'!D49),\n              IF($R$38=1, 'Grenswaarden landbouw'!$D$4:$D$18,\n                 IF($R$38=2, 'Grenswaarden landbouw'!$E$4:$E$18)),\n          \"n.v.t.\")),\n    \"\")),\n\"\")","v":"-"},{"$f":"IF(E$41<>\"\", IF(E$41=\"geen selectie gemaakt\",\"-\",\n    IF('1. Algemeen'!$K$18<>\"\",\n       IF($R$38=0, \"-\",\n          _xlfn.XLOOKUP(1,\n              ('Grenswaarden landbouw'!$B$4:$B$18='1. Algemeen'!$K$18) * ('Grenswaarden landbouw'!$C$4:$C$18='Risicolegger landbouw'!E49),\n              IF($R$38=1, 'Grenswaarden landbouw'!$D$4:$D$18,\n                 IF($R$38=2, 'Grenswaarden landbouw'!$E$4:$E$18)),\n          \"n.v.t.\")),\n    \"\")),\n\"\")","v":""},{"$f":"IF(F$41<>\"\", IF(F$41=\"geen selectie gemaakt\",\"-\",\n    IF('1. Algemeen'!$K$18<>\"\",\n       IF($R$38=0, \"-\",\n          _xlfn.XLOOKUP(1,\n              ('Grenswaarden landbouw'!$B$4:$B$18='1. Algemeen'!$K$18) * ('Grenswaarden landbouw'!$C$4:$C$18='Risicolegger landbouw'!F49),\n              IF($R$38=1, 'Grenswaarden landbouw'!$D$4:$D$18,\n                 IF($R$38=2, 'Grenswaarden landbouw'!$E$4:$E$18)),\n          \"n.v.t.\")),\n    \"\")),\n\"\")","v":""},{"$f":"IF(G$41<>\"\", IF(G$41=\"geen selectie gemaakt\",\"-\",\n    IF('1. Algemeen'!$K$18<>\"\",\n       IF($R$38=0, \"-\",\n          _xlfn.XLOOKUP(1,\n              ('Grenswaarden landbouw'!$B$4:$B$18='1. Algemeen'!$K$18) * ('Grenswaarden landbouw'!$C$4:$C$18='Risicolegger landbouw'!G49),\n              IF($R$38=1, 'Grenswaarden landbouw'!$D$4:$D$18,\n                 IF($R$38=2, 'Grenswaarden landbouw'!$E$4:$E$18)),\n          \"n.v.t.\")),\n    \"\")),\n\"\")","v":""},{"$f":"IF(H$41<>\"\", IF(H$41=\"geen selectie gemaakt\",\"-\",\n    IF('1. Algemeen'!$K$18<>\"\",\n       IF($R$38=0, \"-\",\n          _xlfn.XLOOKUP(1,\n              ('Grenswaarden landbouw'!$B$4:$B$18='1. Algemeen'!$K$18) * ('Grenswaarden landbouw'!$C$4:$C$18='Risicolegger landbouw'!H49),\n              IF($R$38=1, 'Grenswaarden landbouw'!$D$4:$D$18,\n                 IF($R$38=2, 'Grenswaarden landbouw'!$E$4:$E$18)),\n          \"n.v.t.\")),\n    \"\")),\n\"\")","v":""},{"$f":"IF(I$41<>\"\", IF(I$41=\"geen selectie gemaakt\",\"-\",\n    IF('1. Algemeen'!$K$18<>\"\",\n       IF($R$38=0, \"-\",\n          _xlfn.XLOOKUP(1,\n              ('Grenswaarden landbouw'!$B$4:$B$18='1. Algemeen'!$K$18) * ('Grenswaarden landbouw'!$C$4:$C$18='Risicolegger landbouw'!I49),\n              IF($R$38=1, 'Grenswaarden landbouw'!$D$4:$D$18,\n                 IF($R$38=2, 'Grenswaarden landbouw'!$E$4:$E$18)),\n          \"n.v.t.\")),\n    \"\")),\n\"\")","v":""},{"$f":"IF(J$41<>\"\", IF(J$41=\"geen selectie gemaakt\",\"-\",\n    IF('1. Algemeen'!$K$18<>\"\",\n       IF($R$38=0, \"-\",\n          _xlfn.XLOOKUP(1,\n              ('Grenswaarden landbouw'!$B$4:$B$18='1. Algemeen'!$K$18) * ('Grenswaarden landbouw'!$C$4:$C$18='Risicolegger landbouw'!J49),\n              IF($R$38=1, 'Grenswaarden landbouw'!$D$4:$D$18,\n                 IF($R$38=2, 'Grenswaarden landbouw'!$E$4:$E$18)),\n          \"n.v.t.\")),\n    \"\")),\n\"\")","v":""},{"$f":"IF(K$41<>\"\", IF(K$41=\"geen selectie gemaakt\",\"-\",\n    IF('1. Algemeen'!$K$18<>\"\",\n       IF($R$38=0, \"-\",\n          _xlfn.XLOOKUP(1,\n              ('Grenswaarden landbouw'!$B$4:$B$18='1. Algemeen'!$K$18) * ('Grenswaarden landbouw'!$C$4:$C$18='Risicolegger landbouw'!K49),\n              IF($R$38=1, 'Grenswaarden landbouw'!$D$4:$D$18,\n                 IF($R$38=2, 'Grenswaarden landbouw'!$E$4:$E$18)),\n          \"n.v.t.\")),\n    \"\")),\n\"\")","v":""},{"$f":"IF(L$41<>\"\", IF(L$41=\"geen selectie gemaakt\",\"-\",\n    IF('1. Algemeen'!$K$18<>\"\",\n       IF($R$38=0, \"-\",\n          _xlfn.XLOOKUP(1,\n              ('Grenswaarden landbouw'!$B$4:$B$18='1. Algemeen'!$K$18) * ('Grenswaarden landbouw'!$C$4:$C$18='Risicolegger landbouw'!L49),\n              IF($R$38=1, 'Grenswaarden landbouw'!$D$4:$D$18,\n                 IF($R$38=2, 'Grenswaarden landbouw'!$E$4:$E$18)),\n          \"n.v.t.\")),\n    \"\")),\n\"\")","v":""},{"$f":"IF(M$41<>\"\", IF(M$41=\"geen selectie gemaakt\",\"-\",\n    IF('1. Algemeen'!$K$18<>\"\",\n       IF($R$38=0, \"-\",\n          _xlfn.XLOOKUP(1,\n              ('Grenswaarden landbouw'!$B$4:$B$18='1. Algemeen'!$K$18) * ('Grenswaarden landbouw'!$C$4:$C$18='Risicolegger landbouw'!M49),\n              IF($R$38=1, 'Grenswaarden landbouw'!$D$4:$D$18,\n                 IF($R$38=2, 'Grenswaarden landbouw'!$E$4:$E$18)),\n          \"n.v.t.\")),\n    \"\")),\n\"\")","v":""},{"$f":"IF(N$41<>\"\", IF(N$41=\"geen selectie gemaakt\",\"-\",\n    IF('1. Algemeen'!$K$18<>\"\",\n       IF($R$38=0, \"-\",\n          _xlfn.XLOOKUP(1,\n              ('Grenswaarden landbouw'!$B$4:$B$18='1. Algemeen'!$K$18) * ('Grenswaarden landbouw'!$C$4:$C$18='Risicolegger landbouw'!N49),\n              IF($R$38=1, 'Grenswaarden landbouw'!$D$4:$D$18,\n                 IF($R$38=2, 'Grenswaarden landbouw'!$E$4:$E$18)),\n          \"n.v.t.\")),\n    \"\")),\n\"\")","v":""}]
[]
[null,null,null,"Conservatief"]
[]
[null,null,{"$f":"IF('1. Algemeen'!$K$18=\"Zand\", \"Zavel (licht)\",\nIF('1. Algemeen'!$K$18=\"Zavel (licht)\", \"Zavel (zwaar)\",\nIF('1. Algemeen'!$K$18=\"Zavel (zwaar)\", \"Klei\",\nIF('1. Algemeen'!$K$18=\"Klei\", \"Klei\",\nIF('1. Algemeen'!$K$18=\"Veen\", \"Klei\", \"\")))))","v":""}]
[null,null,"Algemeen voor het doelgewas",{"$f":"IF(D$41<>\"\", IF(D$41=\"geen selectie gemaakt\",\"-\",\n    IF($C$61<>\"\",\n       IF($R$38=0, \"-\",\n          _xlfn.XLOOKUP(1,\n              ('Grenswaarden landbouw'!$B$4:$B$18=$C$61) * ('Grenswaarden landbouw'!$C$4:$C$18='Risicolegger landbouw'!D45),\n              IF($R$38=1, 'Grenswaarden landbouw'!$D$4:$D$18,\n                 IF($R$38=2, 'Grenswaarden landbouw'!$E$4:$E$18)),\n          \"n.v.t.\")),\n    \"\")),\n\"\")","v":"-"},{"$f":"IF(E$41<>\"\", IF(E$41=\"geen selectie gemaakt\",\"-\",\n    IF($C$61<>\"\",\n       IF($R$38=0, \"-\",\n          _xlfn.XLOOKUP(1,\n              ('Grenswaarden landbouw'!$B$4:$B$18=$C$61) * ('Grenswaarden landbouw'!$C$4:$C$18='Risicolegger landbouw'!E45),\n              IF($R$38=1, 'Grenswaarden landbouw'!$D$4:$D$18,\n                 IF($R$38=2, 'Grenswaarden landbouw'!$E$4:$E$18)),\n          \"n.v.t.\")),\n    \"\")),\n\"\")","v":""},{"$f":"IF(F$41<>\"\", IF(F$41=\"geen selectie gemaakt\",\"-\",\n    IF($C$61<>\"\",\n       IF($R$38=0, \"-\",\n          _xlfn.XLOOKUP(1,\n              ('Grenswaarden landbouw'!$B$4:$B$18=$C$61) * ('Grenswaarden landbouw'!$C$4:$C$18='Risicolegger landbouw'!F45),\n              IF($R$38=1, 'Grenswaarden landbouw'!$D$4:$D$18,\n                 IF($R$38=2, 'Grenswaarden landbouw'!$E$4:$E$18)),\n          \"n.v.t.\")),\n    \"\")),\n\"\")","v":""},{"$f":"IF(G$41<>\"\", IF(G$41=\"geen selectie gemaakt\",\"-\",\n    IF($C$61<>\"\",\n       IF($R$38=0, \"-\",\n          _xlfn.XLOOKUP(1,\n              ('Grenswaarden landbouw'!$B$4:$B$18=$C$61) * ('Grenswaarden landbouw'!$C$4:$C$18='Risicolegger landbouw'!G45),\n              IF($R$38=1, 'Grenswaarden landbouw'!$D$4:$D$18,\n                 IF($R$38=2, 'Grenswaarden landbouw'!$E$4:$E$18)),\n          \"n.v.t.\")),\n    \"\")),\n\"\")","v":""},{"$f":"IF(H$41<>\"\", IF(H$41=\"geen selectie gemaakt\",\"-\",\n    IF($C$61<>\"\",\n       IF($R$38=0, \"-\",\n          _xlfn.XLOOKUP(1,\n              ('Grenswaarden landbouw'!$B$4:$B$18=$C$61) * ('Grenswaarden landbouw'!$C$4:$C$18='Risicolegger landbouw'!H45),\n              IF($R$38=1, 'Grenswaarden landbouw'!$D$4:$D$18,\n                 IF($R$38=2, 'Grenswaarden landbouw'!$E$4:$E$18)),\n          \"n.v.t.\")),\n    \"\")),\n\"\")","v":""},{"$f":"IF(I$41<>\"\", IF(I$41=\"geen selectie gemaakt\",\"-\",\n    IF($C$61<>\"\",\n       IF($R$38=0, \"-\",\n          _xlfn.XLOOKUP(1,\n              ('Grenswaarden landbouw'!$B$4:$B$18=$C$61) * ('Grenswaarden landbouw'!$C$4:$C$18='Risicolegger landbouw'!I45),\n              IF($R$38=1, 'Grenswaarden landbouw'!$D$4:$D$18,\n                 IF($R$38=2, 'Grenswaarden landbouw'!$E$4:$E$18)),\n          \"n.v.t.\")),\n    \"\")),\n\"\")","v":""},{"$f":"IF(J$41<>\"\", IF(J$41=\"geen selectie gemaakt\",\"-\",\n    IF($C$61<>\"\",\n       IF($R$38=0, \"-\",\n          _xlfn.XLOOKUP(1,\n              ('Grenswaarden landbouw'!$B$4:$B$18=$C$61) * ('Grenswaarden landbouw'!$C$4:$C$18='Risicolegger landbouw'!J45),\n              IF($R$38=1, 'Grenswaarden landbouw'!$D$4:$D$18,\n                 IF($R$38=2, 'Grenswaarden landbouw'!$E$4:$E$18)),\n          \"n.v.t.\")),\n    \"\")),\n\"\")","v":""},{"$f":"IF(K$41<>\"\", IF(K$41=\"geen selectie gemaakt\",\"-\",\n    IF($C$61<>\"\",\n       IF($R$38=0, \"-\",\n          _xlfn.XLOOKUP(1,\n              ('Grenswaarden landbouw'!$B$4:$B$18=$C$61) * ('Grenswaarden landbouw'!$C$4:$C$18='Risicolegger landbouw'!K45),\n              IF($R$38=1, 'Grenswaarden landbouw'!$D$4:$D$18,\n                 IF($R$38=2, 'Grenswaarden landbouw'!$E$4:$E$18)),\n          \"n.v.t.\")),\n    \"\")),\n\"\")","v":""},{"$f":"IF(L$41<>\"\", IF(L$41=\"geen selectie gemaakt\",\"-\",\n    IF($C$61<>\"\",\n       IF($R$38=0, \"-\",\n          _xlfn.XLOOKUP(1,\n              ('Grenswaarden landbouw'!$B$4:$B$18=$C$61) * ('Grenswaarden landbouw'!$C$4:$C$18='Risicolegger landbouw'!L45),\n              IF($R$38=1, 'Grenswaarden landbouw'!$D$4:$D$18,\n                 IF($R$38=2, 'Grenswaarden landbouw'!$E$4:$E$18)),\n          \"n.v.t.\")),\n    \"\")),\n\"\")","v":""},{"$f":"IF(M$41<>\"\", IF(M$41=\"geen selectie gemaakt\",\"-\",\n    IF($C$61<>\"\",\n       IF($R$38=0, \"-\",\n          _xlfn.XLOOKUP(1,\n              ('Grenswaarden landbouw'!$B$4:$B$18=$C$61) * ('Grenswaarden landbouw'!$C$4:$C$18='Risicolegger landbouw'!M45),\n              IF($R$38=1, 'Grenswaarden landbouw'!$D$4:$D$18,\n                 IF($R$38=2, 'Grenswaarden landbouw'!$E$4:$E$18)),\n          \"n.v.t.\")),\n    \"\")),\n\"\")","v":""},{"$f":"IF(N$41<>\"\", IF(N$41=\"geen selectie gemaakt\",\"-\",\n    IF($C$61<>\"\",\n       IF($R$38=0, \"-\",\n          _xlfn.XLOOKUP(1,\n              ('Grenswaarden landbouw'!$B$4:$B$18=$C$61) * ('Grenswaarden landbouw'!$C$4:$C$18='Risicolegger landbouw'!N45),\n              IF($R$38=1, 'Grenswaarden landbouw'!$D$4:$D$18,\n                 IF($R$38=2, 'Grenswaarden landbouw'!$E$4:$E$18)),\n          \"n.v.t.\")),\n    \"\")),\n\"\")","v":""}]
[null,null,"Tijdens de kiemfase",{"$f":"IF(D$41<>\"\", IF(D$41=\"geen selectie gemaakt\",\"-\",\n    IF($C$61<>\"\",\n       IF($R$38=0, \"-\",\n          _xlfn.XLOOKUP(1,\n              ('Grenswaarden landbouw'!$B$4:$B$18=$C$61) * ('Grenswaarden landbouw'!$C$4:$C$18='Risicolegger landbouw'!D46),\n              IF($R$38=1, 'Grenswaarden landbouw'!$D$4:$D$18,\n                 IF($R$38=2, 'Grenswaarden landbouw'!$E$4:$E$18)),\n          \"n.v.t.\")),\n    \"\")),\n\"\")","v":"-"},{"$f":"IF(E$41<>\"\", IF(E$41=\"geen selectie gemaakt\",\"-\",\n    IF($C$61<>\"\",\n       IF($R$38=0, \"-\",\n          _xlfn.XLOOKUP(1,\n              ('Grenswaarden landbouw'!$B$4:$B$18=$C$61) * ('Grenswaarden landbouw'!$C$4:$C$18='Risicolegger landbouw'!E46),\n              IF($R$38=1, 'Grenswaarden landbouw'!$D$4:$D$18,\n                 IF($R$38=2, 'Grenswaarden landbouw'!$E$4:$E$18)),\n          \"n.v.t.\")),\n    \"\")),\n\"\")","v":""},{"$f":"IF(F$41<>\"\", IF(F$41=\"geen selectie gemaakt\",\"-\",\n    IF($C$61<>\"\",\n       IF($R$38=0, \"-\",\n          _xlfn.XLOOKUP(1,\n              ('Grenswaarden landbouw'!$B$4:$B$18=$C$61) * ('Grenswaarden landbouw'!$C$4:$C$18='Risicolegger landbouw'!F46),\n              IF($R$38=1, 'Grenswaarden landbouw'!$D$4:$D$18,\n                 IF($R$38=2, 'Grenswaarden landbouw'!$E$4:$E$18)),\n          \"n.v.t.\")),\n    \"\")),\n\"\")","v":""},{"$f":"IF(G$41<>\"\", IF(G$41=\"geen selectie gemaakt\",\"-\",\n    IF($C$61<>\"\",\n       IF($R$38=0, \"-\",\n          _xlfn.XLOOKUP(1,\n              ('Grenswaarden landbouw'!$B$4:$B$18=$C$61) * ('Grenswaarden landbouw'!$C$4:$C$18='Risicolegger landbouw'!G46),\n              IF($R$38=1, 'Grenswaarden landbouw'!$D$4:$D$18,\n                 IF($R$38=2, 'Grenswaarden landbouw'!$E$4:$E$18)),\n          \"n.v.t.\")),\n    \"\")),\n\"\")","v":""},{"$f":"IF(H$41<>\"\", IF(H$41=\"geen selectie gemaakt\",\"-\",\n    IF($C$61<>\"\",\n       IF($R$38=0, \"-\",\n          _xlfn.XLOOKUP(1,\n              ('Grenswaarden landbouw'!$B$4:$B$18=$C$61) * ('Grenswaarden landbouw'!$C$4:$C$18='Risicolegger landbouw'!H46),\n              IF($R$38=1, 'Grenswaarden landbouw'!$D$4:$D$18,\n                 IF($R$38=2, 'Grenswaarden landbouw'!$E$4:$E$18)),\n          \"n.v.t.\")),\n    \"\")),\n\"\")","v":""},{"$f":"IF(I$41<>\"\", IF(I$41=\"geen selectie gemaakt\",\"-\",\n    IF($C$61<>\"\",\n       IF($R$38=0, \"-\",\n          _xlfn.XLOOKUP(1,\n              ('Grenswaarden landbouw'!$B$4:$B$18=$C$61) * ('Grenswaarden landbouw'!$C$4:$C$18='Risicolegger landbouw'!I46),\n              IF($R$38=1, 'Grenswaarden landbouw'!$D$4:$D$18,\n                 IF($R$38=2, 'Grenswaarden landbouw'!$E$4:$E$18)),\n          \"n.v.t.\")),\n    \"\")),\n\"\")","v":""},{"$f":"IF(J$41<>\"\", IF(J$41=\"geen selectie gemaakt\",\"-\",\n    IF($C$61<>\"\",\n       IF($R$38=0, \"-\",\n          _xlfn.XLOOKUP(1,\n              ('Grenswaarden landbouw'!$B$4:$B$18=$C$61) * ('Grenswaarden landbouw'!$C$4:$C$18='Risicolegger landbouw'!J46),\n              IF($R$38=1, 'Grenswaarden landbouw'!$D$4:$D$18,\n                 IF($R$38=2, 'Grenswaarden landbouw'!$E$4:$E$18)),\n          \"n.v.t.\")),\n    \"\")),\n\"\")","v":""},{"$f":"IF(K$41<>\"\", IF(K$41=\"geen selectie gemaakt\",\"-\",\n    IF($C$61<>\"\",\n       IF($R$38=0, \"-\",\n          _xlfn.XLOOKUP(1,\n              ('Grenswaarden landbouw'!$B$4:$B$18=$C$61) * ('Grenswaarden landbouw'!$C$4:$C$18='Risicolegger landbouw'!K46),\n              IF($R$38=1, 'Grenswaarden landbouw'!$D$4:$D$18,\n                 IF($R$38=2, 'Grenswaarden landbouw'!$E$4:$E$18)),\n          \"n.v.t.\")),\n    \"\")),\n\"\")","v":""},{"$f":"IF(L$41<>\"\", IF(L$41=\"geen selectie gemaakt\",\"-\",\n    IF($C$61<>\"\",\n       IF($R$38=0, \"-\",\n          _xlfn.XLOOKUP(1,\n              ('Grenswaarden landbouw'!$B$4:$B$18=$C$61) * ('Grenswaarden landbouw'!$C$4:$C$18='Risicolegger landbouw'!L46),\n              IF($R$38=1, 'Grenswaarden landbouw'!$D$4:$D$18,\n                 IF($R$38=2, 'Grenswaarden landbouw'!$E$4:$E$18)),\n          \"n.v.t.\")),\n    \"\")),\n\"\")","v":""},{"$f":"IF(M$41<>\"\", IF(M$41=\"geen selectie gemaakt\",\"-\",\n    IF($C$61<>\"\",\n       IF($R$38=0, \"-\",\n          _xlfn.XLOOKUP(1,\n              ('Grenswaarden landbouw'!$B$4:$B$18=$C$61) * ('Grenswaarden landbouw'!$C$4:$C$18='Risicolegger landbouw'!M46),\n              IF($R$38=1, 'Grenswaarden landbouw'!$D$4:$D$18,\n                 IF($R$38=2, 'Grenswaarden landbouw'!$E$4:$E$18)),\n          \"n.v.t.\")),\n    \"\")),\n\"\")","v":""},{"$f":"IF(N$41<>\"\", IF(N$41=\"geen selectie gemaakt\",\"-\",\n    IF($C$61<>\"\",\n       IF($R$38=0, \"-\",\n          _xlfn.XLOOKUP(1,\n              ('Grenswaarden landbouw'!$B$4:$B$18=$C$61) * ('Grenswaarden landbouw'!$C$4:$C$18='Risicolegger landbouw'!N46),\n              IF($R$38=1, 'Grenswaarden landbouw'!$D$4:$D$18,\n                 IF($R$38=2, 'Grenswaarden landbouw'!$E$4:$E$18)),\n          \"n.v.t.\")),\n    \"\")),\n\"\")","v":""}]
[null,null,"Tijdens de zaailingfase",{"$f":"IF(D$41<>\"\", IF(D$41=\"geen selectie gemaakt\",\"-\",\n    IF($C$61<>\"\",\n       IF($R$38=0, \"-\",\n          _xlfn.XLOOKUP(1,\n              ('Grenswaarden landbouw'!$B$4:$B$18=$C$61) * ('Grenswaarden landbouw'!$C$4:$C$18='Risicolegger landbouw'!D47),\n              IF($R$38=1, 'Grenswaarden landbouw'!$D$4:$D$18,\n                 IF($R$38=2, 'Grenswaarden landbouw'!$E$4:$E$18)),\n          \"n.v.t.\")),\n    \"\")),\n\"\")","v":"-"},{"$f":"IF(E$41<>\"\", IF(E$41=\"geen selectie gemaakt\",\"-\",\n    IF($C$61<>\"\",\n       IF($R$38=0, \"-\",\n          _xlfn.XLOOKUP(1,\n              ('Grenswaarden landbouw'!$B$4:$B$18=$C$61) * ('Grenswaarden landbouw'!$C$4:$C$18='Risicolegger landbouw'!E47),\n              IF($R$38=1, 'Grenswaarden landbouw'!$D$4:$D$18,\n                 IF($R$38=2, 'Grenswaarden landbouw'!$E$4:$E$18)),\n          \"n.v.t.\")),\n    \"\")),\n\"\")","v":""},{"$f":"IF(F$41<>\"\", IF(F$41=\"geen selectie gemaakt\",\"-\",\n    IF($C$61<>\"\",\n       IF($R$38=0, \"-\",\n          _xlfn.XLOOKUP(1,\n              ('Grenswaarden landbouw'!$B$4:$B$18=$C$61) * ('Grenswaarden landbouw'!$C$4:$C$18='Risicolegger landbouw'!F47),\n              IF($R$38=1, 'Grenswaarden landbouw'!$D$4:$D$18,\n                 IF($R$38=2, 'Grenswaarden landbouw'!$E$4:$E$18)),\n          \"n.v.t.\")),\n    \"\")),\n\"\")","v":""},{"$f":"IF(G$41<>\"\", IF(G$41=\"geen selectie gemaakt\",\"-\",\n    IF($C$61<>\"\",\n       IF($R$38=0, \"-\",\n          _xlfn.XLOOKUP(1,\n              ('Grenswaarden landbouw'!$B$4:$B$18=$C$61) * ('Grenswaarden landbouw'!$C$4:$C$18='Risicolegger landbouw'!G47),\n              IF($R$38=1, 'Grenswaarden landbouw'!$D$4:$D$18,\n                 IF($R$38=2, 'Grenswaarden landbouw'!$E$4:$E$18)),\n          \"n.v.t.\")),\n    \"\")),\n\"\")","v":""},{"$f":"IF(H$41<>\"\", IF(H$41=\"geen selectie gemaakt\",\"-\",\n    IF($C$61<>\"\",\n       IF($R$38=0, \"-\",\n          _xlfn.XLOOKUP(1,\n              ('Grenswaarden landbouw'!$B$4:$B$18=$C$61) * ('Grenswaarden landbouw'!$C$4:$C$18='Risicolegger landbouw'!H47),\n              IF($R$38=1, 'Grenswaarden landbouw'!$D$4:$D$18,\n                 IF($R$38=2, 'Grenswaarden landbouw'!$E$4:$E$18)),\n          \"n.v.t.\")),\n    \"\")),\n\"\")","v":""},{"$f":"IF(I$41<>\"\", IF(I$41=\"geen selectie gemaakt\",\"-\",\n    IF($C$61<>\"\",\n       IF($R$38=0, \"-\",\n          _xlfn.XLOOKUP(1,\n              ('Grenswaarden landbouw'!$B$4:$B$18=$C$61) * ('Grenswaarden landbouw'!$C$4:$C$18='Risicolegger landbouw'!I47),\n              IF($R$38=1, 'Grenswaarden landbouw'!$D$4:$D$18,\n                 IF($R$38=2, 'Grenswaarden landbouw'!$E$4:$E$18)),\n          \"n.v.t.\")),\n    \"\")),\n\"\")","v":""},{"$f":"IF(J$41<>\"\", IF(J$41=\"geen selectie gemaakt\",\"-\",\n    IF($C$61<>\"\",\n       IF($R$38=0, \"-\",\n          _xlfn.XLOOKUP(1,\n              ('Grenswaarden landbouw'!$B$4:$B$18=$C$61) * ('Grenswaarden landbouw'!$C$4:$C$18='Risicolegger landbouw'!J47),\n              IF($R$38=1, 'Grenswaarden landbouw'!$D$4:$D$18,\n                 IF($R$38=2, 'Grenswaarden landbouw'!$E$4:$E$18)),\n          \"n.v.t.\")),\n    \"\")),\n\"\")","v":""},{"$f":"IF(K$41<>\"\", IF(K$41=\"geen selectie gemaakt\",\"-\",\n    IF($C$61<>\"\",\n       IF($R$38=0, \"-\",\n          _xlfn.XLOOKUP(1,\n              ('Grenswaarden landbouw'!$B$4:$B$18=$C$61) * ('Grenswaarden landbouw'!$C$4:$C$18='Risicolegger landbouw'!K47),\n              IF($R$38=1, 'Grenswaarden landbouw'!$D$4:$D$18,\n                 IF($R$38=2, 'Grenswaarden landbouw'!$E$4:$E$18)),\n          \"n.v.t.\")),\n    \"\")),\n\"\")","v":""},{"$f":"IF(L$41<>\"\", IF(L$41=\"geen selectie gemaakt\",\"-\",\n    IF($C$61<>\"\",\n       IF($R$38=0, \"-\",\n          _xlfn.XLOOKUP(1,\n              ('Grenswaarden landbouw'!$B$4:$B$18=$C$61) * ('Grenswaarden landbouw'!$C$4:$C$18='Risicolegger landbouw'!L47),\n              IF($R$38=1, 'Grenswaarden landbouw'!$D$4:$D$18,\n                 IF($R$38=2, 'Grenswaarden landbouw'!$E$4:$E$18)),\n          \"n.v.t.\")),\n    \"\")),\n\"\")","v":""},{"$f":"IF(M$41<>\"\", IF(M$41=\"geen selectie gemaakt\",\"-\",\n    IF($C$61<>\"\",\n       IF($R$38=0, \"-\",\n          _xlfn.XLOOKUP(1,\n              ('Grenswaarden landbouw'!$B$4:$B$18=$C$61) * ('Grenswaarden landbouw'!$C$4:$C$18='Risicolegger landbouw'!M47),\n              IF($R$38=1, 'Grenswaarden landbouw'!$D$4:$D$18,\n                 IF($R$38=2, 'Grenswaarden landbouw'!$E$4:$E$18)),\n          \"n.v.t.\")),\n    \"\")),\n\"\")","v":""},{"$f":"IF(N$41<>\"\", IF(N$41=\"geen selectie gemaakt\",\"-\",\n    IF($C$61<>\"\",\n       IF($R$38=0, \"-\",\n          _xlfn.XLOOKUP(1,\n              ('Grenswaarden landbouw'!$B$4:$B$18=$C$61) * ('Grenswaarden landbouw'!$C$4:$C$18='Risicolegger landbouw'!N47),\n              IF($R$38=1, 'Grenswaarden landbouw'!$D$4:$D$18,\n                 IF($R$38=2, 'Grenswaarden landbouw'!$E$4:$E$18)),\n          \"n.v.t.\")),\n    \"\")),\n\"\")","v":""}]
[null,null,"Tijdens de vegetatieve groei",{"$f":"IF(D$41<>\"\", IF(D$41=\"geen selectie gemaakt\",\"-\",\n    IF($C$61<>\"\",\n       IF($R$38=0, \"-\",\n          _xlfn.XLOOKUP(1,\n              ('Grenswaarden landbouw'!$B$4:$B$18=$C$61) * ('Grenswaarden landbouw'!$C$4:$C$18='Risicolegger landbouw'!D48),\n              IF($R$38=1, 'Grenswaarden landbouw'!$D$4:$D$18,\n                 IF($R$38=2, 'Grenswaarden landbouw'!$E$4:$E$18)),\n          \"n.v.t.\")),\n    \"\")),\n\"\")","v":"-"},{"$f":"IF(E$41<>\"\", IF(E$41=\"geen selectie gemaakt\",\"-\",\n    IF($C$61<>\"\",\n       IF($R$38=0, \"-\",\n          _xlfn.XLOOKUP(1,\n              ('Grenswaarden landbouw'!$B$4:$B$18=$C$61) * ('Grenswaarden landbouw'!$C$4:$C$18='Risicolegger landbouw'!E48),\n              IF($R$38=1, 'Grenswaarden landbouw'!$D$4:$D$18,\n                 IF($R$38=2, 'Grenswaarden landbouw'!$E$4:$E$18)),\n          \"n.v.t.\")),\n    \"\")),\n\"\")","v":""},{"$f":"IF(F$41<>\"\", IF(F$41=\"geen selectie gemaakt\",\"-\",\n    IF($C$61<>\"\",\n       IF($R$38=0, \"-\",\n          _xlfn.XLOOKUP(1,\n              ('Grenswaarden landbouw'!$B$4:$B$18=$C$61) * ('Grenswaarden landbouw'!$C$4:$C$18='Risicolegger landbouw'!F48),\n              IF($R$38=1, 'Grenswaarden landbouw'!$D$4:$D$18,\n                 IF($R$38=2, 'Grenswaarden landbouw'!$E$4:$E$18)),\n          \"n.v.t.\")),\n    \"\")),\n\"\")","v":""},{"$f":"IF(G$41<>\"\", IF(G$41=\"geen selectie gemaakt\",\"-\",\n    IF($C$61<>\"\",\n       IF($R$38=0, \"-\",\n          _xlfn.XLOOKUP(1,\n              ('Grenswaarden landbouw'!$B$4:$B$18=$C$61) * ('Grenswaarden landbouw'!$C$4:$C$18='Risicolegger landbouw'!G48),\n              IF($R$38=1, 'Grenswaarden landbouw'!$D$4:$D$18,\n                 IF($R$38=2, 'Grenswaarden landbouw'!$E$4:$E$18)),\n          \"n.v.t.\")),\n    \"\")),\n\"\")","v":""},{"$f":"IF(H$41<>\"\", IF(H$41=\"geen selectie gemaakt\",\"-\",\n    IF($C$61<>\"\",\n       IF($R$38=0, \"-\",\n          _xlfn.XLOOKUP(1,\n              ('Grenswaarden landbouw'!$B$4:$B$18=$C$61) * ('Grenswaarden landbouw'!$C$4:$C$18='Risicolegger landbouw'!H48),\n              IF($R$38=1, 'Grenswaarden landbouw'!$D$4:$D$18,\n                 IF($R$38=2, 'Grenswaarden landbouw'!$E$4:$E$18)),\n          \"n.v.t.\")),\n    \"\")),\n\"\")","v":""},{"$f":"IF(I$41<>\"\", IF(I$41=\"geen selectie gemaakt\",\"-\",\n    IF($C$61<>\"\",\n       IF($R$38=0, \"-\",\n          _xlfn.XLOOKUP(1,\n              ('Grenswaarden landbouw'!$B$4:$B$18=$C$61) * ('Grenswaarden landbouw'!$C$4:$C$18='Risicolegger landbouw'!I48),\n              IF($R$38=1, 'Grenswaarden landbouw'!$D$4:$D$18,\n                 IF($R$38=2, 'Grenswaarden landbouw'!$E$4:$E$18)),\n          \"n.v.t.\")),\n    \"\")),\n\"\")","v":""},{"$f":"IF(J$41<>\"\", IF(J$41=\"geen selectie gemaakt\",\"-\",\n    IF($C$61<>\"\",\n       IF($R$38=0, \"-\",\n          _xlfn.XLOOKUP(1,\n              ('Grenswaarden landbouw'!$B$4:$B$18=$C$61) * ('Grenswaarden landbouw'!$C$4:$C$18='Risicolegger landbouw'!J48),\n              IF($R$38=1, 'Grenswaarden landbouw'!$D$4:$D$18,\n                 IF($R$38=2, 'Grenswaarden landbouw'!$E$4:$E$18)),\n          \"n.v.t.\")),\n    \"\")),\n\"\")","v":""},{"$f":"IF(K$41<>\"\", IF(K$41=\"geen selectie gemaakt\",\"-\",\n    IF($C$61<>\"\",\n       IF($R$38=0, \"-\",\n          _xlfn.XLOOKUP(1,\n              ('Grenswaarden landbouw'!$B$4:$B$18=$C$61) * ('Grenswaarden landbouw'!$C$4:$C$18='Risicolegger landbouw'!K48),\n              IF($R$38=1, 'Grenswaarden landbouw'!$D$4:$D$18,\n                 IF($R$38=2, 'Grenswaarden landbouw'!$E$4:$E$18)),\n          \"n.v.t.\")),\n    \"\")),\n\"\")","v":""},{"$f":"IF(L$41<>\"\", IF(L$41=\"geen selectie gemaakt\",\"-\",\n    IF($C$61<>\"\",\n       IF($R$38=0, \"-\",\n          _xlfn.XLOOKUP(1,\n              ('Grenswaarden landbouw'!$B$4:$B$18=$C$61) * ('Grenswaarden landbouw'!$C$4:$C$18='Risicolegger landbouw'!L48),\n              IF($R$38=1, 'Grenswaarden landbouw'!$D$4:$D$18,\n                 IF($R$38=2, 'Grenswaarden landbouw'!$E$4:$E$18)),\n          \"n.v.t.\")),\n    \"\")),\n\"\")","v":""},{"$f":"IF(M$41<>\"\", IF(M$41=\"geen selectie gemaakt\",\"-\",\n    IF($C$61<>\"\",\n       IF($R$38=0, \"-\",\n          _xlfn.XLOOKUP(1,\n              ('Grenswaarden landbouw'!$B$4:$B$18=$C$61) * ('Grenswaarden landbouw'!$C$4:$C$18='Risicolegger landbouw'!M48),\n              IF($R$38=1, 'Grenswaarden landbouw'!$D$4:$D$18,\n                 IF($R$38=2, 'Grenswaarden landbouw'!$E$4:$E$18)),\n          \"n.v.t.\")),\n    \"\")),\n\"\")","v":""},{"$f":"IF(N$41<>\"\", IF(N$41=\"geen selectie gemaakt\",\"-\",\n    IF($C$61<>\"\",\n       IF($R$38=0, \"-\",\n          _xlfn.XLOOKUP(1,\n              ('Grenswaarden landbouw'!$B$4:$B$18=$C$61) * ('Grenswaarden landbouw'!$C$4:$C$18='Risicolegger landbouw'!N48),\n              IF($R$38=1, 'Grenswaarden landbouw'!$D$4:$D$18,\n                 IF($R$38=2, 'Grenswaarden landbouw'!$E$4:$E$18)),\n          \"n.v.t.\")),\n    \"\")),\n\"\")","v":""}]
[null,null,"Tijdens de oogst",{"$f":"IF(D$41<>\"\", IF(D$41=\"geen selectie gemaakt\",\"-\",\n    IF($C$61<>\"\",\n       IF($R$38=0, \"-\",\n          _xlfn.XLOOKUP(1,\n              ('Grenswaarden landbouw'!$B$4:$B$18=$C$61) * ('Grenswaarden landbouw'!$C$4:$C$18='Risicolegger landbouw'!D49),\n              IF($R$38=1, 'Grenswaarden landbouw'!$D$4:$D$18,\n                 IF($R$38=2, 'Grenswaarden landbouw'!$E$4:$E$18)),\n          \"n.v.t.\")),\n    \"\")),\n\"\")","v":"-"},{"$f":"IF(E$41<>\"\", IF(E$41=\"geen selectie gemaakt\",\"-\",\n    IF($C$61<>\"\",\n       IF($R$38=0, \"-\",\n          _xlfn.XLOOKUP(1,\n              ('Grenswaarden landbouw'!$B$4:$B$18=$C$61) * ('Grenswaarden landbouw'!$C$4:$C$18='Risicolegger landbouw'!E49),\n              IF($R$38=1, 'Grenswaarden landbouw'!$D$4:$D$18,\n                 IF($R$38=2, 'Grenswaarden landbouw'!$E$4:$E$18)),\n          \"n.v.t.\")),\n    \"\")),\n\"\")","v":""},{"$f":"IF(F$41<>\"\", IF(F$41=\"geen selectie gemaakt\",\"-\",\n    IF($C$61<>\"\",\n       IF($R$38=0, \"-\",\n          _xlfn.XLOOKUP(1,\n              ('Grenswaarden landbouw'!$B$4:$B$18=$C$61) * ('Grenswaarden landbouw'!$C$4:$C$18='Risicolegger landbouw'!F49),\n              IF($R$38=1, 'Grenswaarden landbouw'!$D$4:$D$18,\n                 IF($R$38=2, 'Grenswaarden landbouw'!$E$4:$E$18)),\n          \"n.v.t.\")),\n    \"\")),\n\"\")","v":""},{"$f":"IF(G$41<>\"\", IF(G$41=\"geen selectie gemaakt\",\"-\",\n    IF($C$61<>\"\",\n       IF($R$38=0, \"-\",\n          _xlfn.XLOOKUP(1,\n              ('Grenswaarden landbouw'!$B$4:$B$18=$C$61) * ('Grenswaarden landbouw'!$C$4:$C$18='Risicolegger landbouw'!G49),\n              IF($R$38=1, 'Grenswaarden landbouw'!$D$4:$D$18,\n                 IF($R$38=2, 'Grenswaarden landbouw'!$E$4:$E$18)),\n          \"n.v.t.\")),\n    \"\")),\n\"\")","v":""},{"$f":"IF(H$41<>\"\", IF(H$41=\"geen selectie gemaakt\",\"-\",\n    IF($C$61<>\"\",\n       IF($R$38=0, \"-\",\n          _xlfn.XLOOKUP(1,\n              ('Grenswaarden landbouw'!$B$4:$B$18=$C$61) * ('Grenswaarden landbouw'!$C$4:$C$18='Risicolegger landbouw'!H49),\n              IF($R$38=1, 'Grenswaarden landbouw'!$D$4:$D$18,\n                 IF($R$38=2, 'Grenswaarden landbouw'!$E$4:$E$18)),\n          \"n.v.t.\")),\n    \"\")),\n\"\")","v":""},{"$f":"IF(I$41<>\"\", IF(I$41=\"geen selectie gemaakt\",\"-\",\n    IF($C$61<>\"\",\n       IF($R$38=0, \"-\",\n          _xlfn.XLOOKUP(1,\n              ('Grenswaarden landbouw'!$B$4:$B$18=$C$61) * ('Grenswaarden landbouw'!$C$4:$C$18='Risicolegger landbouw'!I49),\n              IF($R$38=1, 'Grenswaarden landbouw'!$D$4:$D$18,\n                 IF($R$38=2, 'Grenswaarden landbouw'!$E$4:$E$18)),\n          \"n.v.t.\")),\n    \"\")),\n\"\")","v":""},{"$f":"IF(J$41<>\"\", IF(J$41=\"geen selectie gemaakt\",\"-\",\n    IF($C$61<>\"\",\n       IF($R$38=0, \"-\",\n          _xlfn.XLOOKUP(1,\n              ('Grenswaarden landbouw'!$B$4:$B$18=$C$61) * ('Grenswaarden landbouw'!$C$4:$C$18='Risicolegger landbouw'!J49),\n              IF($R$38=1, 'Grenswaarden landbouw'!$D$4:$D$18,\n                 IF($R$38=2, 'Grenswaarden landbouw'!$E$4:$E$18)),\n          \"n.v.t.\")),\n    \"\")),\n\"\")","v":""},{"$f":"IF(K$41<>\"\", IF(K$41=\"geen selectie gemaakt\",\"-\",\n    IF($C$61<>\"\",\n       IF($R$38=0, \"-\",\n          _xlfn.XLOOKUP(1,\n              ('Grenswaarden landbouw'!$B$4:$B$18=$C$61) * ('Grenswaarden landbouw'!$C$4:$C$18='Risicolegger landbouw'!K49),\n              IF($R$38=1, 'Grenswaarden landbouw'!$D$4:$D$18,\n                 IF($R$38=2, 'Grenswaarden landbouw'!$E$4:$E$18)),\n          \"n.v.t.\")),\n    \"\")),\n\"\")","v":""},{"$f":"IF(L$41<>\"\", IF(L$41=\"geen selectie gemaakt\",\"-\",\n    IF($C$61<>\"\",\n       IF($R$38=0, \"-\",\n          _xlfn.XLOOKUP(1,\n              ('Grenswaarden landbouw'!$B$4:$B$18=$C$61) * ('Grenswaarden landbouw'!$C$4:$C$18='Risicolegger landbouw'!L49),\n              IF($R$38=1, 'Grenswaarden landbouw'!$D$4:$D$18,\n                 IF($R$38=2, 'Grenswaarden landbouw'!$E$4:$E$18)),\n          \"n.v.t.\")),\n    \"\")),\n\"\")","v":""},{"$f":"IF(M$41<>\"\", IF(M$41=\"geen selectie gemaakt\",\"-\",\n    IF($C$61<>\"\",\n       IF($R$38=0, \"-\",\n          _xlfn.XLOOKUP(1,\n              ('Grenswaarden landbouw'!$B$4:$B$18=$C$61) * ('Grenswaarden landbouw'!$C$4:$C$18='Risicolegger landbouw'!M49),\n              IF($R$38=1, 'Grenswaarden landbouw'!$D$4:$D$18,\n                 IF($R$38=2, 'Grenswaarden landbouw'!$E$4:$E$18)),\n          \"n.v.t.\")),\n    \"\")),\n\"\")","v":""},{"$f":"IF(N$41<>\"\", IF(N$41=\"geen selectie gemaakt\",\"-\",\n    IF($C$61<>\"\",\n       IF($R$38=0, \"-\",\n          _xlfn.XLOOKUP(1,\n              ('Grenswaarden landbouw'!$B$4:$B$18=$C$61) * ('Grenswaarden landbouw'!$C$4:$C$18='Risicolegger landbouw'!N49),\n              IF($R$38=1, 'Grenswaarden landbouw'!$D$4:$D$18,\n                 IF($R$38=2, 'Grenswaarden landbouw'!$E$4:$E$18)),\n          \"n.v.t.\")),\n    \"\")),\n\"\")","v":""}]
[]
[]
[]
[]
["BLOK 3: RISICO'S DOELGEWASSEN                                                                              BLOK 3: RISICO'S DOELGEWASSEN                                                                              BLOK 3: RISICO'S DOELGEWASSEN\n- HUIDIGE SITUATIE -                                                                                                       - HUIDIGE SITUATIE -                                                                                                       - HUIDIGE SITUATIE -   "]
[null,null,"Oordeelsblok 3. zoutgehalte huidige situatie",null,null,"maximaal zoutgehalte huidige situatie:",{"$f":"IF(bool_opp_irrigatie=\"Ja\",maximaal_zout_huidig,IF(bool_opp_irrigatie=\"Nee\",maximaal_zoutgehalte_huidig_irrigatie,\"niet opgegeven\"))","v":"niet opgegeven"},{"$f":"IF(R38=1,\"dS/m\",IF(R38=2,\"mg Cl/l\",\"eenheid onbekend\"))","v":"eenheid onbekend"},null,null,"N.B.: De toekomstige situatie (verzilting) wordt beoordeeld in BLOK 4."]
[]
[null,null,"In dit blok wordt een overzicht gegeven in hoeverre er in de huidige situatie al aanleidingen zijn voor risico's t.a.v. verzilting.",null,null,null,null,{"$f":"IF(G72=0,\"Vul eerst een waarde voor zoutgehalte in op tabblad 1. Algemeen en op tabblad 2. Landbouw.\",\"\")","v":""}]
[null,null,"Hiervoor wordt gekeken naar de irrigatietechniek (is er kans op significant waardeverlies?) en of er reeds sprake is van overschrijding van de zouttolerantie (zie blok 'Eigenschappen van geselecteerde doelgewassen' hierboven)."]
[null,null,"Als zoutgehalte voor de huidige situatie wordt de maximale waarde van het irrigatiewater gebruikt. Voor referentie is deze waarde in de hierboven blauwe cel aangegeven."]
[null,null,"De beoordeling wordt uitgesplitst naar de verschillende groeistadia van de doelgewassen (kieming, zaailing, vegetatieve groei en oogst)."]
[null,null,"Voor de bepaling van het eindoordeel per doelgewas wordt de hoogste waarde uit de kolom als leidend geacht. Hiermee is de beoordeling dus mogelijk hoger dan in de praktijk in uw situatie het geval is. "]
[null,null,"Doelgewassen",{"$f":"TRANSPOSE(_xlfn._xlws.FILTER('2. Landbouw'!C10:C20,'2. Landbouw'!F10:F20=TRUE,\"geen selectie gemaakt\"))","v":"geen selectie gemaakt"}]
[]
[null,null,"Risico irrigatietechniek"]
[null,null,"Voor sommige doelgewassen kan irrigatie op het blad snel leiden tot significant waardeverlies."]
[null,null,{"$f":"IF(irrigatie_techniek<>\"\",_xlfn.CONCAT(\"Risico door irrigatie type: \",'2. Landbouw'!K31),\"Kies eerst een irrigatietechniek op tabblad 2. Landbouw.\")","v":"Kies eerst een irrigatietechniek op tabblad 2. Landbouw."},{"$f":"IF(D$79<>\"\",IF(sprinklers=2,\"-\",IF(sprinklers=1,_xlfn.XLOOKUP(D$79,'Grenswaarden landbouw'!$B$22:$B$32,'Grenswaarden landbouw'!$H$22:$H$32),\"laag\")))","v":"-"},{"$f":"IF(E$79<>\"\",IF(sprinklers=2,\"-\",IF(sprinklers=1,_xlfn.XLOOKUP(E$79,'Grenswaarden landbouw'!$B$22:$B$32,'Grenswaarden landbouw'!$H$22:$H$32),\"laag\")),\"\")","v":""},{"$f":"IF(F$79<>\"\",IF(sprinklers=2,\"-\",IF(sprinklers=1,_xlfn.XLOOKUP(F$79,'Grenswaarden landbouw'!$B$22:$B$32,'Grenswaarden landbouw'!$H$22:$H$32),\"laag\")),\"\")","v":""},{"$f":"IF(G$79<>\"\",IF(sprinklers=2,\"-\",IF(sprinklers=1,_xlfn.XLOOKUP(G$79,'Grenswaarden landbouw'!$B$22:$B$32,'Grenswaarden landbouw'!$H$22:$H$32),\"laag\")),\"\")","v":""},{"$f":"IF(H$79<>\"\",IF(sprinklers=2,\"-\",IF(sprinklers=1,_xlfn.XLOOKUP(H$79,'Grenswaarden landbouw'!$B$22:$B$32,'Grenswaarden landbouw'!$H$22:$H$32),\"laag\")),\"\")","v":""},{"$f":"IF(I$79<>\"\",IF(sprinklers=2,\"-\",IF(sprinklers=1,_xlfn.XLOOKUP(I$79,'Grenswaarden landbouw'!$B$22:$B$32,'Grenswaarden landbouw'!$H$22:$H$32),\"laag\")),\"\")","v":""},{"$f":"IF(J$79<>\"\",IF(sprinklers=2,\"-\",IF(sprinklers=1,_xlfn.XLOOKUP(J$79,'Grenswaarden landbouw'!$B$22:$B$32,'Grenswaarden landbouw'!$H$22:$H$32),\"laag\")),\"\")","v":""},{"$f":"IF(K$79<>\"\",IF(sprinklers=2,\"-\",IF(sprinklers=1,_xlfn.XLOOKUP(K$79,'Grenswaarden landbouw'!$B$22:$B$32,'Grenswaarden landbouw'!$H$22:$H$32),\"laag\")),\"\")","v":""},{"$f":"IF(L$79<>\"\",IF(sprinklers=2,\"-\",IF(sprinklers=1,_xlfn.XLOOKUP(L$79,'Grenswaarden landbouw'!$B$22:$B$32,'Grenswaarden landbouw'!$H$22:$H$32),\"laag\")),\"\")","v":""},{"$f":"IF(M$79<>\"\",IF(sprinklers=2,\"-\",IF(sprinklers=1,_xlfn.XLOOKUP(M$79,'Grenswaarden landbouw'!$B$22:$B$32,'Grenswaarden landbouw'!$H$22:$H$32),\"laag\")),\"\")","v":""},{"$f":"IF(N$79<>\"\",IF(sprinklers=2,\"-\",IF(sprinklers=1,_xlfn.XLOOKUP(N$79,'Grenswaarden landbouw'!$B$22:$B$32,'Grenswaarden landbouw'!$H$22:$H$32),\"laag\")),\"\")","v":""}]
[]
[]
[null,null,"Bandbreedte \"normaal\""]
[null,null,"Als het watervolume en de bodemstructuur een laag risico hebben, beschouw dan de risico's binnen de bandbreedte \"normaal\". Dit is effectief rekenen met het bodemtype dat u heeft ingevuld."]
[null,null,"Als het watervolume een midden of hoog risico heeft, beschouw dan de bandbreedte \"conservatief\"."]
[]
[null,null,"Overschrijding grenswaarde zoutgehalte"]
[null,null,"Is er in de huidige situatie al sprake van een overschrijding van de grenswaarde? Hiervoor wordt de maximale waarde van het zoutgehalte gebruikt (zie blauwe cell bovenaan dit blok)"]
[null,null,"Algemeen voor het doelgewas",{"$f":"IF(AND(D$79<>\"\",D53<>\"\"),IF(OR($G$72=0,$G$72=\"niet opgegeven\"),\"-\",IF($G$72>D53,\"Ja\",IF(D53=\"n.v.t.\",\"n.v.t.\",\"Nee\"))),\"-\")","v":"-"},{"$f":"IF(AND(E$79<>\"\",E53<>\"\"),IF(OR($G$72=0,$G$72=\"niet opgegeven\"),\"-\",IF($G$72>E53,\"Ja\",IF(E53=\"n.v.t.\",\"n.v.t.\",\"Nee\"))),\"-\")","v":"-"},"-","-","-","-","-","-","-","-","-"]
[null,null,"Tijdens de kiemfase",{"$f":"IF(AND(D$79<>\"\",D54<>\"\"),IF(OR($G$72=0,$G$72=\"niet opgegeven\"),\"-\",IF($G$72>D54,\"Ja\",IF(D54=\"n.v.t.\",\"n.v.t.\",\"Nee\"))),\"-\")","v":"-"},"-","-","-","-","-","-","-","-","-","-"]
[null,null,"Tijdens de zaailingfase","-","-","-","-","-","-","-","-","-","-","-"]
[null,null,"Tijdens de vegetatieve groei","-","-","-","-","-","-","-","-","-","-","-"]
[null,null,"Tijdens de oogst","-","-","-","-","-","-","-","-","-","-","-"]
[]
[null,null,"Risico zoutgehalte"]
[null,null,"Beoordeling o.b.v. zouttolerantie (gevoelig = hoog, matig tolerant = midden, tolerant = laag). Overschrijding van de zouttolerantie en een hoog risico op waardevermindering leiden per definitie tot een hoog risico. Irrigatie op het blad verhoogt het risico met 1 niveau."]
[null,null,"Algemeen voor het doelgewas",{"$f":"IF(D92=\"-\",\"-\",IF(D$79<>\"\",\nIF(OR(D92=\"n.v.t.\",D92=\"...\"),\"n.v.t.\",\nIF(D92=\"Ja\",\"hoog\",\nIF(sprinklers=0,\n_xlfn.XLOOKUP(D$79,'Grenswaarden landbouw'!$B$36:$B$46,'Grenswaarden landbouw'!$C$36:$C$46),\n_xlfn.XLOOKUP(D$79,'Grenswaarden landbouw'!$B$50:$B$60,'Grenswaarden landbouw'!$C$50:$C$60)\n)\n)\n),\n\"\"))","v":"-"},{"$f":"IF(E92=\"-\",\"-\",IF(E$79<>\"\",\nIF(OR(E92=\"n.v.t.\",E92=\"...\"),\"n.v.t.\",\nIF(E92=\"Ja\",\"hoog\",\nIF(sprinklers=0,\n_xlfn.XLOOKUP(E$79,'Grenswaarden landbouw'!$B$36:$B$46,'Grenswaarden landbouw'!$C$36:$C$46),\n_xlfn.XLOOKUP(E$79,'Grenswaarden landbouw'!$B$50:$B$60,'Grenswaarden landbouw'!$C$50:$C$60)\n)\n)\n),\n\"\"))","v":"-"},{"$f":"IF(F92=\"-\",\"-\",IF(F$79<>\"\",\nIF(OR(F92=\"n.v.t.\",F92=\"...\"),\"n.v.t.\",\nIF(F92=\"Ja\",\"hoog\",\nIF(sprinklers=0,\n_xlfn.XLOOKUP(F$79,'Grenswaarden landbouw'!$B$36:$B$46,'Grenswaarden landbouw'!$C$36:$C$46),\n_xlfn.XLOOKUP(F$79,'Grenswaarden landbouw'!$B$50:$B$60,'Grenswaarden landbouw'!$C$50:$C$60)\n)\n)\n),\n\"\"))","v":"-"},{"$f":"IF(G92=\"-\",\"-\",IF(G$79<>\"\",\nIF(OR(G92=\"n.v.t.\",G92=\"...\"),\"n.v.t.\",\nIF(G92=\"Ja\",\"hoog\",\nIF(sprinklers=0,\n_xlfn.XLOOKUP(G$79,'Grenswaarden landbouw'!$B$36:$B$46,'Grenswaarden landbouw'!$C$36:$C$46),\n_xlfn.XLOOKUP(G$79,'Grenswaarden landbouw'!$B$50:$B$60,'Grenswaarden landbouw'!$C$50:$C$60)\n)\n)\n),\n\"\"))","v":"-"},{"$f":"IF(H92=\"-\",\"-\",IF(H$79<>\"\",\nIF(OR(H92=\"n.v.t.\",H92=\"...\"),\"n.v.t.\",\nIF(H92=\"Ja\",\"hoog\",\nIF(sprinklers=0,\n_xlfn.XLOOKUP(H$79,'Grenswaarden landbouw'!$B$36:$B$46,'Grenswaarden landbouw'!$C$36:$C$46),\n_xlfn.XLOOKUP(H$79,'Grenswaarden landbouw'!$B$50:$B$60,'Grenswaarden landbouw'!$C$50:$C$60)\n)\n)\n),\n\"\"))","v":"-"},{"$f":"IF(I92=\"-\",\"-\",IF(I$79<>\"\",\nIF(OR(I92=\"n.v.t.\",I92=\"...\"),\"n.v.t.\",\nIF(I92=\"Ja\",\"hoog\",\nIF(sprinklers=0,\n_xlfn.XLOOKUP(I$79,'Grenswaarden landbouw'!$B$36:$B$46,'Grenswaarden landbouw'!$C$36:$C$46),\n_xlfn.XLOOKUP(I$79,'Grenswaarden landbouw'!$B$50:$B$60,'Grenswaarden landbouw'!$C$50:$C$60)\n)\n)\n),\n\"\"))","v":"-"},{"$f":"IF(J92=\"-\",\"-\",IF(J$79<>\"\",\nIF(OR(J92=\"n.v.t.\",J92=\"...\"),\"n.v.t.\",\nIF(J92=\"Ja\",\"hoog\",\nIF(sprinklers=0,\n_xlfn.XLOOKUP(J$79,'Grenswaarden landbouw'!$B$36:$B$46,'Grenswaarden landbouw'!$C$36:$C$46),\n_xlfn.XLOOKUP(J$79,'Grenswaarden landbouw'!$B$50:$B$60,'Grenswaarden landbouw'!$C$50:$C$60)\n)\n)\n),\n\"\"))","v":"-"},{"$f":"IF(K92=\"-\",\"-\",IF(K$79<>\"\",\nIF(OR(K92=\"n.v.t.\",K92=\"...\"),\"n.v.t.\",\nIF(K92=\"Ja\",\"hoog\",\nIF(sprinklers=0,\n_xlfn.XLOOKUP(K$79,'Grenswaarden landbouw'!$B$36:$B$46,'Grenswaarden landbouw'!$C$36:$C$46),\n_xlfn.XLOOKUP(K$79,'Grenswaarden landbouw'!$B$50:$B$60,'Grenswaarden landbouw'!$C$50:$C$60)\n)\n)\n),\n\"\"))","v":"-"},{"$f":"IF(L92=\"-\",\"-\",IF(L$79<>\"\",\nIF(OR(L92=\"n.v.t.\",L92=\"...\"),\"n.v.t.\",\nIF(L92=\"Ja\",\"hoog\",\nIF(sprinklers=0,\n_xlfn.XLOOKUP(L$79,'Grenswaarden landbouw'!$B$36:$B$46,'Grenswaarden landbouw'!$C$36:$C$46),\n_xlfn.XLOOKUP(L$79,'Grenswaarden landbouw'!$B$50:$B$60,'Grenswaarden landbouw'!$C$50:$C$60)\n)\n)\n),\n\"\"))","v":"-"},{"$f":"IF(M92=\"-\",\"-\",IF(M$79<>\"\",\nIF(OR(M92=\"n.v.t.\",M92=\"...\"),\"n.v.t.\",\nIF(M92=\"Ja\",\"hoog\",\nIF(sprinklers=0,\n_xlfn.XLOOKUP(M$79,'Grenswaarden landbouw'!$B$36:$B$46,'Grenswaarden landbouw'!$C$36:$C$46),\n_xlfn.XLOOKUP(M$79,'Grenswaarden landbouw'!$B$50:$B$60,'Grenswaarden landbouw'!$C$50:$C$60)\n)\n)\n),\n\"\"))","v":"-"},{"$f":"IF(N92=\"-\",\"-\",IF(N$79<>\"\",\nIF(OR(N92=\"n.v.t.\",N92=\"...\"),\"n.v.t.\",\nIF(N92=\"Ja\",\"hoog\",\nIF(sprinklers=0,\n_xlfn.XLOOKUP(N$79,'Grenswaarden landbouw'!$B$36:$B$46,'Grenswaarden landbouw'!$C$36:$C$46),\n_xlfn.XLOOKUP(N$79,'Grenswaarden landbouw'!$B$50:$B$60,'Grenswaarden landbouw'!$C$50:$C$60)\n)\n)\n),\n\"\"))","v":"-"}]
[null,null,"Tijdens de kiemfase",{"$f":"IF(D93=\"-\",\"-\",IF(D$79<>\"\",\nIF(OR(D93=\"n.v.t.\",D93=\"...\"),\"n.v.t.\",\nIF(D93=\"Ja\",\"hoog\",\nIF(sprinklers=0,\n_xlfn.XLOOKUP(D$79,'Grenswaarden landbouw'!$B$36:$B$46,'Grenswaarden landbouw'!$D$36:$D$46),\n_xlfn.XLOOKUP(D$79,'Grenswaarden landbouw'!$B$50:$B$60,'Grenswaarden landbouw'!$D$50:$D$60)\n)\n)\n),\n\"\"))","v":"-"},{"$f":"IF(E93=\"-\",\"-\",IF(E$79<>\"\",\nIF(OR(E93=\"n.v.t.\",E93=\"...\"),\"n.v.t.\",\nIF(E93=\"Ja\",\"hoog\",\nIF(sprinklers=0,\n_xlfn.XLOOKUP(E$79,'Grenswaarden landbouw'!$B$36:$B$46,'Grenswaarden landbouw'!$D$36:$D$46),\n_xlfn.XLOOKUP(E$79,'Grenswaarden landbouw'!$B$50:$B$60,'Grenswaarden landbouw'!$D$50:$D$60)\n)\n)\n),\n\"\"))","v":"-"},{"$f":"IF(F93=\"-\",\"-\",IF(F$79<>\"\",\nIF(OR(F93=\"n.v.t.\",F93=\"...\"),\"n.v.t.\",\nIF(F93=\"Ja\",\"hoog\",\nIF(sprinklers=0,\n_xlfn.XLOOKUP(F$79,'Grenswaarden landbouw'!$B$36:$B$46,'Grenswaarden landbouw'!$D$36:$D$46),\n_xlfn.XLOOKUP(F$79,'Grenswaarden landbouw'!$B$50:$B$60,'Grenswaarden landbouw'!$D$50:$D$60)\n)\n)\n),\n\"\"))","v":"-"},{"$f":"IF(G93=\"-\",\"-\",IF(G$79<>\"\",\nIF(OR(G93=\"n.v.t.\",G93=\"...\"),\"n.v.t.\",\nIF(G93=\"Ja\",\"hoog\",\nIF(sprinklers=0,\n_xlfn.XLOOKUP(G$79,'Grenswaarden landbouw'!$B$36:$B$46,'Grenswaarden landbouw'!$D$36:$D$46),\n_xlfn.XLOOKUP(G$79,'Grenswaarden landbouw'!$B$50:$B$60,'Grenswaarden landbouw'!$D$50:$D$60)\n)\n)\n),\n\"\"))","v":"-"},{"$f":"IF(H93=\"-\",\"-\",IF(H$79<>\"\",\nIF(OR(H93=\"n.v.t.\",H93=\"...\"),\"n.v.t.\",\nIF(H93=\"Ja\",\"hoog\",\nIF(sprinklers=0,\n_xlfn.XLOOKUP(H$79,'Grenswaarden landbouw'!$B$36:$B$46,'Grenswaarden landbouw'!$D$36:$D$46),\n_xlfn.XLOOKUP(H$79,'Grenswaarden landbouw'!$B$50:$B$60,'Grenswaarden landbouw'!$D$50:$D$60)\n)\n)\n),\n\"\"))","v":"-"},{"$f":"IF(I93=\"-\",\"-\",IF(I$79<>\"\",\nIF(OR(I93=\"n.v.t.\",I93=\"...\"),\"n.v.t.\",\nIF(I93=\"Ja\",\"hoog\",\nIF(sprinklers=0,\n_xlfn.XLOOKUP(I$79,'Grenswaarden landbouw'!$B$36:$B$46,'Grenswaarden landbouw'!$D$36:$D$46),\n_xlfn.XLOOKUP(I$79,'Grenswaarden landbouw'!$B$50:$B$60,'Grenswaarden landbouw'!$D$50:$D$60)\n)\n)\n),\n\"\"))","v":"-"},{"$f":"IF(J93=\"-\",\"-\",IF(J$79<>\"\",\nIF(OR(J93=\"n.v.t.\",J93=\"...\"),\"n.v.t.\",\nIF(J93=\"Ja\",\"hoog\",\nIF(sprinklers=0,\n_xlfn.XLOOKUP(J$79,'Grenswaarden landbouw'!$B$36:$B$46,'Grenswaarden landbouw'!$D$36:$D$46),\n_xlfn.XLOOKUP(J$79,'Grenswaarden landbouw'!$B$50:$B$60,'Grenswaarden landbouw'!$D$50:$D$60)\n)\n)\n),\n\"\"))","v":"-"},{"$f":"IF(K93=\"-\",\"-\",IF(K$79<>\"\",\nIF(OR(K93=\"n.v.t.\",K93=\"...\"),\"n.v.t.\",\nIF(K93=\"Ja\",\"hoog\",\nIF(sprinklers=0,\n_xlfn.XLOOKUP(K$79,'Grenswaarden landbouw'!$B$36:$B$46,'Grenswaarden landbouw'!$D$36:$D$46),\n_xlfn.XLOOKUP(K$79,'Grenswaarden landbouw'!$B$50:$B$60,'Grenswaarden landbouw'!$D$50:$D$60)\n)\n)\n),\n\"\"))","v":"-"},{"$f":"IF(L93=\"-\",\"-\",IF(L$79<>\"\",\nIF(OR(L93=\"n.v.t.\",L93=\"...\"),\"n.v.t.\",\nIF(L93=\"Ja\",\"hoog\",\nIF(sprinklers=0,\n_xlfn.XLOOKUP(L$79,'Grenswaarden landbouw'!$B$36:$B$46,'Grenswaarden landbouw'!$D$36:$D$46),\n_xlfn.XLOOKUP(L$79,'Grenswaarden landbouw'!$B$50:$B$60,'Grenswaarden landbouw'!$D$50:$D$60)\n)\n)\n),\n\"\"))","v":"-"},{"$f":"IF(M93=\"-\",\"-\",IF(M$79<>\"\",\nIF(OR(M93=\"n.v.t.\",M93=\"...\"),\"n.v.t.\",\nIF(M93=\"Ja\",\"hoog\",\nIF(sprinklers=0,\n_xlfn.XLOOKUP(M$79,'Grenswaarden landbouw'!$B$36:$B$46,'Grenswaarden landbouw'!$D$36:$D$46),\n_xlfn.XLOOKUP(M$79,'Grenswaarden landbouw'!$B$50:$B$60,'Grenswaarden landbouw'!$D$50:$D$60)\n)\n)\n),\n\"\"))","v":"-"},{"$f":"IF(N93=\"-\",\"-\",IF(N$79<>\"\",\nIF(OR(N93=\"n.v.t.\",N93=\"...\"),\"n.v.t.\",\nIF(N93=\"Ja\",\"hoog\",\nIF(sprinklers=0,\n_xlfn.XLOOKUP(N$79,'Grenswaarden landbouw'!$B$36:$B$46,'Grenswaarden landbouw'!$D$36:$D$46),\n_xlfn.XLOOKUP(N$79,'Grenswaarden landbouw'!$B$50:$B$60,'Grenswaarden landbouw'!$D$50:$D$60)\n)\n)\n),\n\"\"))","v":"-"}]
[null,null,"Tijdens de zaailingfase",{"$f":"IF(D94=\"-\",\"-\",IF(D$79<>\"\",\nIF(OR(D94=\"n.v.t.\",D94=\"...\"),\"n.v.t.\",\nIF(D94=\"Ja\",\"hoog\",\nIF(sprinklers=0,\n_xlfn.XLOOKUP(D$79,'Grenswaarden landbouw'!$B$36:$B$46,'Grenswaarden landbouw'!$E$36:$E$46),\n_xlfn.XLOOKUP(D$79,'Grenswaarden landbouw'!$B$50:$B$60,'Grenswaarden landbouw'!$E$50:$E$60)\n)\n)\n),\n\"\"))","v":"-"},{"$f":"IF(E94=\"-\",\"-\",IF(E$79<>\"\",\nIF(OR(E94=\"n.v.t.\",E94=\"...\"),\"n.v.t.\",\nIF(E94=\"Ja\",\"hoog\",\nIF(sprinklers=0,\n_xlfn.XLOOKUP(E$79,'Grenswaarden landbouw'!$B$36:$B$46,'Grenswaarden landbouw'!$E$36:$E$46),\n_xlfn.XLOOKUP(E$79,'Grenswaarden landbouw'!$B$50:$B$60,'Grenswaarden landbouw'!$E$50:$E$60)\n)\n)\n),\n\"\"))","v":"-"},{"$f":"IF(F94=\"-\",\"-\",IF(F$79<>\"\",\nIF(OR(F94=\"n.v.t.\",F94=\"...\"),\"n.v.t.\",\nIF(F94=\"Ja\",\"hoog\",\nIF(sprinklers=0,\n_xlfn.XLOOKUP(F$79,'Grenswaarden landbouw'!$B$36:$B$46,'Grenswaarden landbouw'!$E$36:$E$46),\n_xlfn.XLOOKUP(F$79,'Grenswaarden landbouw'!$B$50:$B$60,'Grenswaarden landbouw'!$E$50:$E$60)\n)\n)\n),\n\"\"))","v":"-"},{"$f":"IF(G94=\"-\",\"-\",IF(G$79<>\"\",\nIF(OR(G94=\"n.v.t.\",G94=\"...\"),\"n.v.t.\",\nIF(G94=\"Ja\",\"hoog\",\nIF(sprinklers=0,\n_xlfn.XLOOKUP(G$79,'Grenswaarden landbouw'!$B$36:$B$46,'Grenswaarden landbouw'!$E$36:$E$46),\n_xlfn.XLOOKUP(G$79,'Grenswaarden landbouw'!$B$50:$B$60,'Grenswaarden landbouw'!$E$50:$E$60)\n)\n)\n),\n\"\"))","v":"-"},{"$f":"IF(H94=\"-\",\"-\",IF(H$79<>\"\",\nIF(OR(H94=\"n.v.t.\",H94=\"...\"),\"n.v.t.\",\nIF(H94=\"Ja\",\"hoog\",\nIF(sprinklers=0,\n_xlfn.XLOOKUP(H$79,'Grenswaarden landbouw'!$B$36:$B$46,'Grenswaarden landbouw'!$E$36:$E$46),\n_xlfn.XLOOKUP(H$79,'Grenswaarden landbouw'!$B$50:$B$60,'Grenswaarden landbouw'!$E$50:$E$60)\n)\n)\n),\n\"\"))","v":"-"},{"$f":"IF(I94=\"-\",\"-\",IF(I$79<>\"\",\nIF(OR(I94=\"n.v.t.\",I94=\"...\"),\"n.v.t.\",\nIF(I94=\"Ja\",\"hoog\",\nIF(sprinklers=0,\n_xlfn.XLOOKUP(I$79,'Grenswaarden landbouw'!$B$36:$B$46,'Grenswaarden landbouw'!$E$36:$E$46),\n_xlfn.XLOOKUP(I$79,'Grenswaarden landbouw'!$B$50:$B$60,'Grenswaarden landbouw'!$E$50:$E$60)\n)\n)\n),\n\"\"))","v":"-"},{"$f":"IF(J94=\"-\",\"-\",IF(J$79<>\"\",\nIF(OR(J94=\"n.v.t.\",J94=\"...\"),\"n.v.t.\",\nIF(J94=\"Ja\",\"hoog\",\nIF(sprinklers=0,\n_xlfn.XLOOKUP(J$79,'Grenswaarden landbouw'!$B$36:$B$46,'Grenswaarden landbouw'!$E$36:$E$46),\n_xlfn.XLOOKUP(J$79,'Grenswaarden landbouw'!$B$50:$B$60,'Grenswaarden landbouw'!$E$50:$E$60)\n)\n)\n),\n\"\"))","v":"-"},{"$f":"IF(K94=\"-\",\"-\",IF(K$79<>\"\",\nIF(OR(K94=\"n.v.t.\",K94=\"...\"),\"n.v.t.\",\nIF(K94=\"Ja\",\"hoog\",\nIF(sprinklers=0,\n_xlfn.XLOOKUP(K$79,'Grenswaarden landbouw'!$B$36:$B$46,'Grenswaarden landbouw'!$E$36:$E$46),\n_xlfn.XLOOKUP(K$79,'Grenswaarden landbouw'!$B$50:$B$60,'Grenswaarden landbouw'!$E$50:$E$60)\n)\n)\n),\n\"\"))","v":"-"},{"$f":"IF(L94=\"-\",\"-\",IF(L$79<>\"\",\nIF(OR(L94=\"n.v.t.\",L94=\"...\"),\"n.v.t.\",\nIF(L94=\"Ja\",\"hoog\",\nIF(sprinklers=0,\n_xlfn.XLOOKUP(L$79,'Grenswaarden landbouw'!$B$36:$B$46,'Grenswaarden landbouw'!$E$36:$E$46),\n_xlfn.XLOOKUP(L$79,'Grenswaarden landbouw'!$B$50:$B$60,'Grenswaarden landbouw'!$E$50:$E$60)\n)\n)\n),\n\"\"))","v":"-"},{"$f":"IF(M94=\"-\",\"-\",IF(M$79<>\"\",\nIF(OR(M94=\"n.v.t.\",M94=\"...\"),\"n.v.t.\",\nIF(M94=\"Ja\",\"hoog\",\nIF(sprinklers=0,\n_xlfn.XLOOKUP(M$79,'Grenswaarden landbouw'!$B$36:$B$46,'Grenswaarden landbouw'!$E$36:$E$46),\n_xlfn.XLOOKUP(M$79,'Grenswaarden landbouw'!$B$50:$B$60,'Grenswaarden landbouw'!$E$50:$E$60)\n)\n)\n),\n\"\"))","v":"-"},{"$f":"IF(N94=\"-\",\"-\",IF(N$79<>\"\",\nIF(OR(N94=\"n.v.t.\",N94=\"...\"),\"n.v.t.\",\nIF(N94=\"Ja\",\"hoog\",\nIF(sprinklers=0,\n_xlfn.XLOOKUP(N$79,'Grenswaarden landbouw'!$B$36:$B$46,'Grenswaarden landbouw'!$E$36:$E$46),\n_xlfn.XLOOKUP(N$79,'Grenswaarden landbouw'!$B$50:$B$60,'Grenswaarden landbouw'!$E$50:$E$60)\n)\n)\n),\n\"\"))","v":"-"}]
[null,null,"Tijdens de vegetatieve groei",{"$f":"IF(D95=\"-\",\"-\",IF(D$79<>\"\",\nIF(OR(D95=\"n.v.t.\",D95=\"...\"),\"onbekend\",\nIF(D95=\"Ja\",\"hoog\",\nIF(sprinklers=0,\n_xlfn.XLOOKUP(D$79,'Grenswaarden landbouw'!$B$36:$B$46,'Grenswaarden landbouw'!$F$36:$F$46),\n_xlfn.XLOOKUP(D$79,'Grenswaarden landbouw'!$B$50:$B$60,'Grenswaarden landbouw'!$F$50:$F$60)\n)\n)\n),\n\"\"))","v":"-"},{"$f":"IF(E95=\"-\",\"-\",IF(E$79<>\"\",\nIF(OR(E95=\"n.v.t.\",E95=\"...\"),\"onbekend\",\nIF(E95=\"Ja\",\"hoog\",\nIF(sprinklers=0,\n_xlfn.XLOOKUP(E$79,'Grenswaarden landbouw'!$B$36:$B$46,'Grenswaarden landbouw'!$F$36:$F$46),\n_xlfn.XLOOKUP(E$79,'Grenswaarden landbouw'!$B$50:$B$60,'Grenswaarden landbouw'!$F$50:$F$60)\n)\n)\n),\n\"\"))","v":"-"},{"$f":"IF(F95=\"-\",\"-\",IF(F$79<>\"\",\nIF(OR(F95=\"n.v.t.\",F95=\"...\"),\"onbekend\",\nIF(F95=\"Ja\",\"hoog\",\nIF(sprinklers=0,\n_xlfn.XLOOKUP(F$79,'Grenswaarden landbouw'!$B$36:$B$46,'Grenswaarden landbouw'!$F$36:$F$46),\n_xlfn.XLOOKUP(F$79,'Grenswaarden landbouw'!$B$50:$B$60,'Grenswaarden landbouw'!$F$50:$F$60)\n)\n)\n),\n\"\"))","v":"-"},{"$f":"IF(G95=\"-\",\"-\",IF(G$79<>\"\",\nIF(OR(G95=\"n.v.t.\",G95=\"...\"),\"onbekend\",\nIF(G95=\"Ja\",\"hoog\",\nIF(sprinklers=0,\n_xlfn.XLOOKUP(G$79,'Grenswaarden landbouw'!$B$36:$B$46,'Grenswaarden landbouw'!$F$36:$F$46),\n_xlfn.XLOOKUP(G$79,'Grenswaarden landbouw'!$B$50:$B$60,'Grenswaarden landbouw'!$F$50:$F$60)\n)\n)\n),\n\"\"))","v":"-"},{"$f":"IF(H95=\"-\",\"-\",IF(H$79<>\"\",\nIF(OR(H95=\"n.v.t.\",H95=\"...\"),\"onbekend\",\nIF(H95=\"Ja\",\"hoog\",\nIF(sprinklers=0,\n_xlfn.XLOOKUP(H$79,'Grenswaarden landbouw'!$B$36:$B$46,'Grenswaarden landbouw'!$F$36:$F$46),\n_xlfn.XLOOKUP(H$79,'Grenswaarden landbouw'!$B$50:$B$60,'Grenswaarden landbouw'!$F$50:$F$60)\n)\n)\n),\n\"\"))","v":"-"},{"$f":"IF(I95=\"-\",\"-\",IF(I$79<>\"\",\nIF(OR(I95=\"n.v.t.\",I95=\"...\"),\"onbekend\",\nIF(I95=\"Ja\",\"hoog\",\nIF(sprinklers=0,\n_xlfn.XLOOKUP(I$79,'Grenswaarden landbouw'!$B$36:$B$46,'Grenswaarden landbouw'!$F$36:$F$46),\n_xlfn.XLOOKUP(I$79,'Grenswaarden landbouw'!$B$50:$B$60,'Grenswaarden landbouw'!$F$50:$F$60)\n)\n)\n),\n\"\"))","v":"-"},{"$f":"IF(J95=\"-\",\"-\",IF(J$79<>\"\",\nIF(OR(J95=\"n.v.t.\",J95=\"...\"),\"onbekend\",\nIF(J95=\"Ja\",\"hoog\",\nIF(sprinklers=0,\n_xlfn.XLOOKUP(J$79,'Grenswaarden landbouw'!$B$36:$B$46,'Grenswaarden landbouw'!$F$36:$F$46),\n_xlfn.XLOOKUP(J$79,'Grenswaarden landbouw'!$B$50:$B$60,'Grenswaarden landbouw'!$F$50:$F$60)\n)\n)\n),\n\"\"))","v":"-"},{"$f":"IF(K95=\"-\",\"-\",IF(K$79<>\"\",\nIF(OR(K95=\"n.v.t.\",K95=\"...\"),\"onbekend\",\nIF(K95=\"Ja\",\"hoog\",\nIF(sprinklers=0,\n_xlfn.XLOOKUP(K$79,'Grenswaarden landbouw'!$B$36:$B$46,'Grenswaarden landbouw'!$F$36:$F$46),\n_xlfn.XLOOKUP(K$79,'Grenswaarden landbouw'!$B$50:$B$60,'Grenswaarden landbouw'!$F$50:$F$60)\n)\n)\n),\n\"\"))","v":"-"},{"$f":"IF(L95=\"-\",\"-\",IF(L$79<>\"\",\nIF(OR(L95=\"n.v.t.\",L95=\"...\"),\"onbekend\",\nIF(L95=\"Ja\",\"hoog\",\nIF(sprinklers=0,\n_xlfn.XLOOKUP(L$79,'Grenswaarden landbouw'!$B$36:$B$46,'Grenswaarden landbouw'!$F$36:$F$46),\n_xlfn.XLOOKUP(L$79,'Grenswaarden landbouw'!$B$50:$B$60,'Grenswaarden landbouw'!$F$50:$F$60)\n)\n)\n),\n\"\"))","v":"-"},{"$f":"IF(M95=\"-\",\"-\",IF(M$79<>\"\",\nIF(OR(M95=\"n.v.t.\",M95=\"...\"),\"onbekend\",\nIF(M95=\"Ja\",\"hoog\",\nIF(sprinklers=0,\n_xlfn.XLOOKUP(M$79,'Grenswaarden landbouw'!$B$36:$B$46,'Grenswaarden landbouw'!$F$36:$F$46),\n_xlfn.XLOOKUP(M$79,'Grenswaarden landbouw'!$B$50:$B$60,'Grenswaarden landbouw'!$F$50:$F$60)\n)\n)\n),\n\"\"))","v":"-"},{"$f":"IF(N95=\"-\",\"-\",IF(N$79<>\"\",\nIF(OR(N95=\"n.v.t.\",N95=\"...\"),\"onbekend\",\nIF(N95=\"Ja\",\"hoog\",\nIF(sprinklers=0,\n_xlfn.XLOOKUP(N$79,'Grenswaarden landbouw'!$B$36:$B$46,'Grenswaarden landbouw'!$F$36:$F$46),\n_xlfn.XLOOKUP(N$79,'Grenswaarden landbouw'!$B$50:$B$60,'Grenswaarden landbouw'!$F$50:$F$60)\n)\n)\n),\n\"\"))","v":"-"}]
[null,null,"Tijdens de oogst",{"$f":"IF(D96=\"-\",\"-\",IF(D$79<>\"\",\nIF(OR(D96=\"n.v.t.\",D96=\"...\"),\"onbekend\",\nIF(D96=\"Ja\",\"hoog\",\nIF(sprinklers=0,\n_xlfn.XLOOKUP(D$79,'Grenswaarden landbouw'!$B$36:$B$46,'Grenswaarden landbouw'!$G$36:$G$46),\n_xlfn.XLOOKUP(D$79,'Grenswaarden landbouw'!$B$50:$B$60,'Grenswaarden landbouw'!$G$50:$G$60)\n)\n)\n),\n\"\"))","v":"-"},{"$f":"IF(E96=\"-\",\"-\",IF(E$79<>\"\",\nIF(OR(E96=\"n.v.t.\",E96=\"...\"),\"onbekend\",\nIF(E96=\"Ja\",\"hoog\",\nIF(sprinklers=0,\n_xlfn.XLOOKUP(E$79,'Grenswaarden landbouw'!$B$36:$B$46,'Grenswaarden landbouw'!$G$36:$G$46),\n_xlfn.XLOOKUP(E$79,'Grenswaarden landbouw'!$B$50:$B$60,'Grenswaarden landbouw'!$G$50:$G$60)\n)\n)\n),\n\"\"))","v":"-"},{"$f":"IF(F96=\"-\",\"-\",IF(F$79<>\"\",\nIF(OR(F96=\"n.v.t.\",F96=\"...\"),\"onbekend\",\nIF(F96=\"Ja\",\"hoog\",\nIF(sprinklers=0,\n_xlfn.XLOOKUP(F$79,'Grenswaarden landbouw'!$B$36:$B$46,'Grenswaarden landbouw'!$G$36:$G$46),\n_xlfn.XLOOKUP(F$79,'Grenswaarden landbouw'!$B$50:$B$60,'Grenswaarden landbouw'!$G$50:$G$60)\n)\n)\n),\n\"\"))","v":"-"},{"$f":"IF(G96=\"-\",\"-\",IF(G$79<>\"\",\nIF(OR(G96=\"n.v.t.\",G96=\"...\"),\"onbekend\",\nIF(G96=\"Ja\",\"hoog\",\nIF(sprinklers=0,\n_xlfn.XLOOKUP(G$79,'Grenswaarden landbouw'!$B$36:$B$46,'Grenswaarden landbouw'!$G$36:$G$46),\n_xlfn.XLOOKUP(G$79,'Grenswaarden landbouw'!$B$50:$B$60,'Grenswaarden landbouw'!$G$50:$G$60)\n)\n)\n),\n\"\"))","v":"-"},{"$f":"IF(H96=\"-\",\"-\",IF(H$79<>\"\",\nIF(OR(H96=\"n.v.t.\",H96=\"...\"),\"onbekend\",\nIF(H96=\"Ja\",\"hoog\",\nIF(sprinklers=0,\n_xlfn.XLOOKUP(H$79,'Grenswaarden landbouw'!$B$36:$B$46,'Grenswaarden landbouw'!$G$36:$G$46),\n_xlfn.XLOOKUP(H$79,'Grenswaarden landbouw'!$B$50:$B$60,'Grenswaarden landbouw'!$G$50:$G$60)\n)\n)\n),\n\"\"))","v":"-"},{"$f":"IF(I96=\"-\",\"-\",IF(I$79<>\"\",\nIF(OR(I96=\"n.v.t.\",I96=\"...\"),\"onbekend\",\nIF(I96=\"Ja\",\"hoog\",\nIF(sprinklers=0,\n_xlfn.XLOOKUP(I$79,'Grenswaarden landbouw'!$B$36:$B$46,'Grenswaarden landbouw'!$G$36:$G$46),\n_xlfn.XLOOKUP(I$79,'Grenswaarden landbouw'!$B$50:$B$60,'Grenswaarden landbouw'!$G$50:$G$60)\n)\n)\n),\n\"\"))","v":"-"},{"$f":"IF(J96=\"-\",\"-\",IF(J$79<>\"\",\nIF(OR(J96=\"n.v.t.\",J96=\"...\"),\"onbekend\",\nIF(J96=\"Ja\",\"hoog\",\nIF(sprinklers=0,\n_xlfn.XLOOKUP(J$79,'Grenswaarden landbouw'!$B$36:$B$46,'Grenswaarden landbouw'!$G$36:$G$46),\n_xlfn.XLOOKUP(J$79,'Grenswaarden landbouw'!$B$50:$B$60,'Grenswaarden landbouw'!$G$50:$G$60)\n)\n)\n),\n\"\"))","v":"-"},{"$f":"IF(K96=\"-\",\"-\",IF(K$79<>\"\",\nIF(OR(K96=\"n.v.t.\",K96=\"...\"),\"onbekend\",\nIF(K96=\"Ja\",\"hoog\",\nIF(sprinklers=0,\n_xlfn.XLOOKUP(K$79,'Grenswaarden landbouw'!$B$36:$B$46,'Grenswaarden landbouw'!$G$36:$G$46),\n_xlfn.XLOOKUP(K$79,'Grenswaarden landbouw'!$B$50:$B$60,'Grenswaarden landbouw'!$G$50:$G$60)\n)\n)\n),\n\"\"))","v":"-"},{"$f":"IF(L96=\"-\",\"-\",IF(L$79<>\"\",\nIF(OR(L96=\"n.v.t.\",L96=\"...\"),\"onbekend\",\nIF(L96=\"Ja\",\"hoog\",\nIF(sprinklers=0,\n_xlfn.XLOOKUP(L$79,'Grenswaarden landbouw'!$B$36:$B$46,'Grenswaarden landbouw'!$G$36:$G$46),\n_xlfn.XLOOKUP(L$79,'Grenswaarden landbouw'!$B$50:$B$60,'Grenswaarden landbouw'!$G$50:$G$60)\n)\n)\n),\n\"\"))","v":"-"},{"$f":"IF(M96=\"-\",\"-\",IF(M$79<>\"\",\nIF(OR(M96=\"n.v.t.\",M96=\"...\"),\"onbekend\",\nIF(M96=\"Ja\",\"hoog\",\nIF(sprinklers=0,\n_xlfn.XLOOKUP(M$79,'Grenswaarden landbouw'!$B$36:$B$46,'Grenswaarden landbouw'!$G$36:$G$46),\n_xlfn.XLOOKUP(M$79,'Grenswaarden landbouw'!$B$50:$B$60,'Grenswaarden landbouw'!$G$50:$G$60)\n)\n)\n),\n\"\"))","v":"-"},{"$f":"IF(N96=\"-\",\"-\",IF(N$79<>\"\",\nIF(OR(N96=\"n.v.t.\",N96=\"...\"),\"onbekend\",\nIF(N96=\"Ja\",\"hoog\",\nIF(sprinklers=0,\n_xlfn.XLOOKUP(N$79,'Grenswaarden landbouw'!$B$36:$B$46,'Grenswaarden landbouw'!$G$36:$G$46),\n_xlfn.XLOOKUP(N$79,'Grenswaarden landbouw'!$B$50:$B$60,'Grenswaarden landbouw'!$G$50:$G$60)\n)\n)\n),\n\"\"))","v":"-"}]
[]
[null,null,"Risico totaal",{"$f":"IF(D$41<>\"\", IF(D$83=\"hoog\", \"hoog\", IF(COUNTIF(D100:D104, \"hoog\") > 0, \"hoog\", IF(COUNTIF(D100:D104, \"midden\") > 0, \"midden\", IF(COUNTIF(D100:D104, \"laag\") > 0, \"laag\", \"-\")))), \"-\")","v":"-"},{"$f":"IF(E$41<>\"\", IF(E$83=\"hoog\", \"hoog\", IF(COUNTIF(E100:E104, \"hoog\") > 0, \"hoog\", IF(COUNTIF(E100:E104, \"midden\") > 0, \"midden\", IF(COUNTIF(E100:E104, \"laag\") > 0, \"laag\", \"-\")))), \"-\")","v":"-"},"-","-","-","-","-","-","-","-","-"]
[null,null,"De hoogste risico waarde bepaalt het risico totaal. Het is aan de gebruiker om in te schatten of dit risico niveau van toepassing is op hun projectgebied. Ter illustratie: een doelgewas kan een hoog/hoger risico hebben tijdens de kiemfase, maar deze fase treedt in het jaar bijvoorbeeld met name op wanneer de kans op verzilting heel klein is. Hierdoor kan het eindrisico (o.b.v. een deskundigenoordeel) lager uitvallen."]
[]
[]
[]
[null,null,"Bandbreedte \"conservatief\""]
[null,null,"Als het watervolume en de bodemstructuur een midden of hoog risico hebben, beschouw dan de risico's binnen de bandbreedte \"conservatief\". Dit is effectief met een kleiïgere bodemstructuur dan die u heeft ingevuld."]
[null,null,"Is het bodemtype dat u heeft ingevuld \"Klei\", dan is er geen verschil tussen de \"normale\" en \"conservatieve\" risicobepaling. Een kleibodem is namelijk al het meest gevoelig voor de effecten van zout."]
[]
[null,null,"Overschrijding grenswaarde zoutgehalte"]
[null,null,"Is er in de huidige situatie al sprake van een overschrijding van de grenswaarde? Hiervoor wordt de maximale waarde van het zoutgehalte gebruikt (zie blauwe cell bovenaan dit blok)"]
[null,null,"Algemeen voor het doelgewas",{"$f":"IF(AND(D$79<>\"\",D62<>\"\"),IF(OR($G$72=0,$G$72=\"niet opgegeven\"),\"-\",IF($G$72>D62,\"Ja\",IF(D62=\"n.v.t.\",\"n.v.t.\",\"Nee\"))),\"-\")","v":"-"},{"$f":"IF(AND(E$79<>\"\",E62<>\"\"),IF(OR($G$72=0,$G$72=\"niet opgegeven\"),\"-\",IF($G$72>E62,\"Ja\",IF(E62=\"n.v.t.\",\"n.v.t.\",\"Nee\"))),\"-\")","v":"-"},"-","-","-","-","-","-","-","-","-"]
[null,null,"Tijdens de kiemfase",{"$f":"IF(AND(D$79<>\"\",D63<>\"\"),IF(OR($G$72=0,$G$72=\"niet opgegeven\"),\"-\",IF($G$72>D63,\"Ja\",IF(D63=\"n.v.t.\",\"n.v.t.\",\"Nee\"))),\"-\")","v":"-"},"-","-","-","-","-","-","-","-","-","-"]
[null,null,"Tijdens de zaailingfase","-","-","-","-","-","-","-","-","-","-","-"]
[null,null,"Tijdens de vegetatieve groei","-","-","-","-","-","-","-","-","-","-","-"]
[null,null,"Tijdens de oogst","-","-","-","-","-","-","-","-","-","-","-"]
[]
[null,null,"Risico zoutgehalte"]
[null,null,"Beoordeling o.b.v. zouttolerantie (gevoelig = hoog, matig tolerant = midden, tolerant = laag). Overschrijding van de zouttolerantie en een hoog risico op waardevermindering leiden per definitie tot een hoog risico. Irrigatie op het blad verhoogt het risico met 1 niveau."]
[null,null,"Algemeen voor het doelgewas",{"$f":"IF(D117=\"-\",\"-\",IF(D$79<>\"\",\nIF(OR(D117=\"n.v.t.\",D117=\"...\"),\"n.v.t.\",\nIF(D117=\"Ja\",\"hoog\",\nIF(sprinklers=0,\n_xlfn.XLOOKUP(D$79,'Grenswaarden landbouw'!$B$36:$B$46,'Grenswaarden landbouw'!$C$36:$C$46),\n_xlfn.XLOOKUP(D$79,'Grenswaarden landbouw'!$B$50:$B$60,'Grenswaarden landbouw'!$C$50:$C$60)\n)\n)\n),\n\"\"))","v":"-"},{"$f":"IF(E117=\"-\",\"-\",IF(E$79<>\"\",\nIF(OR(E117=\"n.v.t.\",E117=\"...\"),\"n.v.t.\",\nIF(E117=\"Ja\",\"hoog\",\nIF(sprinklers=0,\n_xlfn.XLOOKUP(E$79,'Grenswaarden landbouw'!$B$36:$B$46,'Grenswaarden landbouw'!$C$36:$C$46),\n_xlfn.XLOOKUP(E$79,'Grenswaarden landbouw'!$B$50:$B$60,'Grenswaarden landbouw'!$C$50:$C$60)\n)\n)\n),\n\"\"))","v":"-"},{"$f":"IF(F117=\"-\",\"-\",IF(F$79<>\"\",\nIF(OR(F117=\"n.v.t.\",F117=\"...\"),\"n.v.t.\",\nIF(F117=\"Ja\",\"hoog\",\nIF(sprinklers=0,\n_xlfn.XLOOKUP(F$79,'Grenswaarden landbouw'!$B$36:$B$46,'Grenswaarden landbouw'!$C$36:$C$46),\n_xlfn.XLOOKUP(F$79,'Grenswaarden landbouw'!$B$50:$B$60,'Grenswaarden landbouw'!$C$50:$C$60)\n)\n)\n),\n\"\"))","v":"-"},{"$f":"IF(G117=\"-\",\"-\",IF(G$79<>\"\",\nIF(OR(G117=\"n.v.t.\",G117=\"...\"),\"n.v.t.\",\nIF(G117=\"Ja\",\"hoog\",\nIF(sprinklers=0,\n_xlfn.XLOOKUP(G$79,'Grenswaarden landbouw'!$B$36:$B$46,'Grenswaarden landbouw'!$C$36:$C$46),\n_xlfn.XLOOKUP(G$79,'Grenswaarden landbouw'!$B$50:$B$60,'Grenswaarden landbouw'!$C$50:$C$60)\n)\n)\n),\n\"\"))","v":"-"},{"$f":"IF(H117=\"-\",\"-\",IF(H$79<>\"\",\nIF(OR(H117=\"n.v.t.\",H117=\"...\"),\"n.v.t.\",\nIF(H117=\"Ja\",\"hoog\",\nIF(sprinklers=0,\n_xlfn.XLOOKUP(H$79,'Grenswaarden landbouw'!$B$36:$B$46,'Grenswaarden landbouw'!$C$36:$C$46),\n_xlfn.XLOOKUP(H$79,'Grenswaarden landbouw'!$B$50:$B$60,'Grenswaarden landbouw'!$C$50:$C$60)\n)\n)\n),\n\"\"))","v":"-"},{"$f":"IF(I117=\"-\",\"-\",IF(I$79<>\"\",\nIF(OR(I117=\"n.v.t.\",I117=\"...\"),\"n.v.t.\",\nIF(I117=\"Ja\",\"hoog\",\nIF(sprinklers=0,\n_xlfn.XLOOKUP(I$79,'Grenswaarden landbouw'!$B$36:$B$46,'Grenswaarden landbouw'!$C$36:$C$46),\n_xlfn.XLOOKUP(I$79,'Grenswaarden landbouw'!$B$50:$B$60,'Grenswaarden landbouw'!$C$50:$C$60)\n)\n)\n),\n\"\"))","v":"-"},{"$f":"IF(J117=\"-\",\"-\",IF(J$79<>\"\",\nIF(OR(J117=\"n.v.t.\",J117=\"...\"),\"n.v.t.\",\nIF(J117=\"Ja\",\"hoog\",\nIF(sprinklers=0,\n_xlfn.XLOOKUP(J$79,'Grenswaarden landbouw'!$B$36:$B$46,'Grenswaarden landbouw'!$C$36:$C$46),\n_xlfn.XLOOKUP(J$79,'Grenswaarden landbouw'!$B$50:$B$60,'Grenswaarden landbouw'!$C$50:$C$60)\n)\n)\n),\n\"\"))","v":"-"},{"$f":"IF(K117=\"-\",\"-\",IF(K$79<>\"\",\nIF(OR(K117=\"n.v.t.\",K117=\"...\"),\"n.v.t.\",\nIF(K117=\"Ja\",\"hoog\",\nIF(sprinklers=0,\n_xlfn.XLOOKUP(K$79,'Grenswaarden landbouw'!$B$36:$B$46,'Grenswaarden landbouw'!$C$36:$C$46),\n_xlfn.XLOOKUP(K$79,'Grenswaarden landbouw'!$B$50:$B$60,'Grenswaarden landbouw'!$C$50:$C$60)\n)\n)\n),\n\"\"))","v":"-"},{"$f":"IF(L117=\"-\",\"-\",IF(L$79<>\"\",\nIF(OR(L117=\"n.v.t.\",L117=\"...\"),\"n.v.t.\",\nIF(L117=\"Ja\",\"hoog\",\nIF(sprinklers=0,\n_xlfn.XLOOKUP(L$79,'Grenswaarden landbouw'!$B$36:$B$46,'Grenswaarden landbouw'!$C$36:$C$46),\n_xlfn.XLOOKUP(L$79,'Grenswaarden landbouw'!$B$50:$B$60,'Grenswaarden landbouw'!$C$50:$C$60)\n)\n)\n),\n\"\"))","v":"-"},{"$f":"IF(M117=\"-\",\"-\",IF(M$79<>\"\",\nIF(OR(M117=\"n.v.t.\",M117=\"...\"),\"n.v.t.\",\nIF(M117=\"Ja\",\"hoog\",\nIF(sprinklers=0,\n_xlfn.XLOOKUP(M$79,'Grenswaarden landbouw'!$B$36:$B$46,'Grenswaarden landbouw'!$C$36:$C$46),\n_xlfn.XLOOKUP(M$79,'Grenswaarden landbouw'!$B$50:$B$60,'Grenswaarden landbouw'!$C$50:$C$60)\n)\n)\n),\n\"\"))","v":"-"},{"$f":"IF(N117=\"-\",\"-\",IF(N$79<>\"\",\nIF(OR(N117=\"n.v.t.\",N117=\"...\"),\"n.v.t.\",\nIF(N117=\"Ja\",\"hoog\",\nIF(sprinklers=0,\n_xlfn.XLOOKUP(N$79,'Grenswaarden landbouw'!$B$36:$B$46,'Grenswaarden landbouw'!$C$36:$C$46),\n_xlfn.XLOOKUP(N$79,'Grenswaarden landbouw'!$B$50:$B$60,'Grenswaarden landbouw'!$C$50:$C$60)\n)\n)\n),\n\"\"))","v":"-"}]
[null,null,"Tijdens de kiemfase",{"$f":"IF(D118=\"-\",\"-\",IF(D$79<>\"\",\nIF(OR(D118=\"n.v.t.\",D118=\"...\"),\"n.v.t.\",\nIF(D118=\"Ja\",\"hoog\",\nIF(sprinklers=0,\n_xlfn.XLOOKUP(D$79,'Grenswaarden landbouw'!$B$36:$B$46,'Grenswaarden landbouw'!$D$36:$D$46),\n_xlfn.XLOOKUP(D$79,'Grenswaarden landbouw'!$B$50:$B$60,'Grenswaarden landbouw'!$D$50:$D$60)\n)\n)\n),\n\"\"))","v":"-"},{"$f":"IF(E118=\"-\",\"-\",IF(E$79<>\"\",\nIF(OR(E118=\"n.v.t.\",E118=\"...\"),\"n.v.t.\",\nIF(E118=\"Ja\",\"hoog\",\nIF(sprinklers=0,\n_xlfn.XLOOKUP(E$79,'Grenswaarden landbouw'!$B$36:$B$46,'Grenswaarden landbouw'!$D$36:$D$46),\n_xlfn.XLOOKUP(E$79,'Grenswaarden landbouw'!$B$50:$B$60,'Grenswaarden landbouw'!$D$50:$D$60)\n)\n)\n),\n\"\"))","v":"-"},{"$f":"IF(F118=\"-\",\"-\",IF(F$79<>\"\",\nIF(OR(F118=\"n.v.t.\",F118=\"...\"),\"n.v.t.\",\nIF(F118=\"Ja\",\"hoog\",\nIF(sprinklers=0,\n_xlfn.XLOOKUP(F$79,'Grenswaarden landbouw'!$B$36:$B$46,'Grenswaarden landbouw'!$D$36:$D$46),\n_xlfn.XLOOKUP(F$79,'Grenswaarden landbouw'!$B$50:$B$60,'Grenswaarden landbouw'!$D$50:$D$60)\n)\n)\n),\n\"\"))","v":"-"},{"$f":"IF(G118=\"-\",\"-\",IF(G$79<>\"\",\nIF(OR(G118=\"n.v.t.\",G118=\"...\"),\"n.v.t.\",\nIF(G118=\"Ja\",\"hoog\",\nIF(sprinklers=0,\n_xlfn.XLOOKUP(G$79,'Grenswaarden landbouw'!$B$36:$B$46,'Grenswaarden landbouw'!$D$36:$D$46),\n_xlfn.XLOOKUP(G$79,'Grenswaarden landbouw'!$B$50:$B$60,'Grenswaarden landbouw'!$D$50:$D$60)\n)\n)\n),\n\"\"))","v":"-"},{"$f":"IF(H118=\"-\",\"-\",IF(H$79<>\"\",\nIF(OR(H118=\"n.v.t.\",H118=\"...\"),\"n.v.t.\",\nIF(H118=\"Ja\",\"hoog\",\nIF(sprinklers=0,\n_xlfn.XLOOKUP(H$79,'Grenswaarden landbouw'!$B$36:$B$46,'Grenswaarden landbouw'!$D$36:$D$46),\n_xlfn.XLOOKUP(H$79,'Grenswaarden landbouw'!$B$50:$B$60,'Grenswaarden landbouw'!$D$50:$D$60)\n)\n)\n),\n\"\"))","v":"-"},{"$f":"IF(I118=\"-\",\"-\",IF(I$79<>\"\",\nIF(OR(I118=\"n.v.t.\",I118=\"...\"),\"n.v.t.\",\nIF(I118=\"Ja\",\"hoog\",\nIF(sprinklers=0,\n_xlfn.XLOOKUP(I$79,'Grenswaarden landbouw'!$B$36:$B$46,'Grenswaarden landbouw'!$D$36:$D$46),\n_xlfn.XLOOKUP(I$79,'Grenswaarden landbouw'!$B$50:$B$60,'Grenswaarden landbouw'!$D$50:$D$60)\n)\n)\n),\n\"\"))","v":"-"},{"$f":"IF(J118=\"-\",\"-\",IF(J$79<>\"\",\nIF(OR(J118=\"n.v.t.\",J118=\"...\"),\"n.v.t.\",\nIF(J118=\"Ja\",\"hoog\",\nIF(sprinklers=0,\n_xlfn.XLOOKUP(J$79,'Grenswaarden landbouw'!$B$36:$B$46,'Grenswaarden landbouw'!$D$36:$D$46),\n_xlfn.XLOOKUP(J$79,'Grenswaarden landbouw'!$B$50:$B$60,'Grenswaarden landbouw'!$D$50:$D$60)\n)\n)\n),\n\"\"))","v":"-"},{"$f":"IF(K118=\"-\",\"-\",IF(K$79<>\"\",\nIF(OR(K118=\"n.v.t.\",K118=\"...\"),\"n.v.t.\",\nIF(K118=\"Ja\",\"hoog\",\nIF(sprinklers=0,\n_xlfn.XLOOKUP(K$79,'Grenswaarden landbouw'!$B$36:$B$46,'Grenswaarden landbouw'!$D$36:$D$46),\n_xlfn.XLOOKUP(K$79,'Grenswaarden landbouw'!$B$50:$B$60,'Grenswaarden landbouw'!$D$50:$D$60)\n)\n)\n),\n\"\"))","v":"-"},{"$f":"IF(L118=\"-\",\"-\",IF(L$79<>\"\",\nIF(OR(L118=\"n.v.t.\",L118=\"...\"),\"n.v.t.\",\nIF(L118=\"Ja\",\"hoog\",\nIF(sprinklers=0,\n_xlfn.XLOOKUP(L$79,'Grenswaarden landbouw'!$B$36:$B$46,'Grenswaarden landbouw'!$D$36:$D$46),\n_xlfn.XLOOKUP(L$79,'Grenswaarden landbouw'!$B$50:$B$60,'Grenswaarden landbouw'!$D$50:$D$60)\n)\n)\n),\n\"\"))","v":"-"},{"$f":"IF(M118=\"-\",\"-\",IF(M$79<>\"\",\nIF(OR(M118=\"n.v.t.\",M118=\"...\"),\"n.v.t.\",\nIF(M118=\"Ja\",\"hoog\",\nIF(sprinklers=0,\n_xlfn.XLOOKUP(M$79,'Grenswaarden landbouw'!$B$36:$B$46,'Grenswaarden landbouw'!$D$36:$D$46),\n_xlfn.XLOOKUP(M$79,'Grenswaarden landbouw'!$B$50:$B$60,'Grenswaarden landbouw'!$D$50:$D$60)\n)\n)\n),\n\"\"))","v":"-"},{"$f":"IF(N118=\"-\",\"-\",IF(N$79<>\"\",\nIF(OR(N118=\"n.v.t.\",N118=\"...\"),\"n.v.t.\",\nIF(N118=\"Ja\",\"hoog\",\nIF(sprinklers=0,\n_xlfn.XLOOKUP(N$79,'Grenswaarden landbouw'!$B$36:$B$46,'Grenswaarden landbouw'!$D$36:$D$46),\n_xlfn.XLOOKUP(N$79,'Grenswaarden landbouw'!$B$50:$B$60,'Grenswaarden landbouw'!$D$50:$D$60)\n)\n)\n),\n\"\"))","v":"-"}]
[null,null,"Tijdens de zaailingfase",{"$f":"IF(D119=\"-\",\"-\",IF(D$79<>\"\",\nIF(OR(D119=\"n.v.t.\",D119=\"...\"),\"n.v.t.\",\nIF(D119=\"Ja\",\"hoog\",\nIF(sprinklers=0,\n_xlfn.XLOOKUP(D$79,'Grenswaarden landbouw'!$B$36:$B$46,'Grenswaarden landbouw'!$E$36:$E$46),\n_xlfn.XLOOKUP(D$79,'Grenswaarden landbouw'!$B$50:$B$60,'Grenswaarden landbouw'!$E$50:$E$60)\n)\n)\n),\n\"\"))","v":"-"},{"$f":"IF(E119=\"-\",\"-\",IF(E$79<>\"\",\nIF(OR(E119=\"n.v.t.\",E119=\"...\"),\"n.v.t.\",\nIF(E119=\"Ja\",\"hoog\",\nIF(sprinklers=0,\n_xlfn.XLOOKUP(E$79,'Grenswaarden landbouw'!$B$36:$B$46,'Grenswaarden landbouw'!$E$36:$E$46),\n_xlfn.XLOOKUP(E$79,'Grenswaarden landbouw'!$B$50:$B$60,'Grenswaarden landbouw'!$E$50:$E$60)\n)\n)\n),\n\"\"))","v":"-"},{"$f":"IF(F119=\"-\",\"-\",IF(F$79<>\"\",\nIF(OR(F119=\"n.v.t.\",F119=\"...\"),\"n.v.t.\",\nIF(F119=\"Ja\",\"hoog\",\nIF(sprinklers=0,\n_xlfn.XLOOKUP(F$79,'Grenswaarden landbouw'!$B$36:$B$46,'Grenswaarden landbouw'!$E$36:$E$46),\n_xlfn.XLOOKUP(F$79,'Grenswaarden landbouw'!$B$50:$B$60,'Grenswaarden landbouw'!$E$50:$E$60)\n)\n)\n),\n\"\"))","v":"-"},{"$f":"IF(G119=\"-\",\"-\",IF(G$79<>\"\",\nIF(OR(G119=\"n.v.t.\",G119=\"...\"),\"n.v.t.\",\nIF(G119=\"Ja\",\"hoog\",\nIF(sprinklers=0,\n_xlfn.XLOOKUP(G$79,'Grenswaarden landbouw'!$B$36:$B$46,'Grenswaarden landbouw'!$E$36:$E$46),\n_xlfn.XLOOKUP(G$79,'Grenswaarden landbouw'!$B$50:$B$60,'Grenswaarden landbouw'!$E$50:$E$60)\n)\n)\n),\n\"\"))","v":"-"},{"$f":"IF(H119=\"-\",\"-\",IF(H$79<>\"\",\nIF(OR(H119=\"n.v.t.\",H119=\"...\"),\"n.v.t.\",\nIF(H119=\"Ja\",\"hoog\",\nIF(sprinklers=0,\n_xlfn.XLOOKUP(H$79,'Grenswaarden landbouw'!$B$36:$B$46,'Grenswaarden landbouw'!$E$36:$E$46),\n_xlfn.XLOOKUP(H$79,'Grenswaarden landbouw'!$B$50:$B$60,'Grenswaarden landbouw'!$E$50:$E$60)\n)\n)\n),\n\"\"))","v":"-"},{"$f":"IF(I119=\"-\",\"-\",IF(I$79<>\"\",\nIF(OR(I119=\"n.v.t.\",I119=\"...\"),\"n.v.t.\",\nIF(I119=\"Ja\",\"hoog\",\nIF(sprinklers=0,\n_xlfn.XLOOKUP(I$79,'Grenswaarden landbouw'!$B$36:$B$46,'Grenswaarden landbouw'!$E$36:$E$46),\n_xlfn.XLOOKUP(I$79,'Grenswaarden landbouw'!$B$50:$B$60,'Grenswaarden landbouw'!$E$50:$E$60)\n)\n)\n),\n\"\"))","v":"-"},{"$f":"IF(J119=\"-\",\"-\",IF(J$79<>\"\",\nIF(OR(J119=\"n.v.t.\",J119=\"...\"),\"n.v.t.\",\nIF(J119=\"Ja\",\"hoog\",\nIF(sprinklers=0,\n_xlfn.XLOOKUP(J$79,'Grenswaarden landbouw'!$B$36:$B$46,'Grenswaarden landbouw'!$E$36:$E$46),\n_xlfn.XLOOKUP(J$79,'Grenswaarden landbouw'!$B$50:$B$60,'Grenswaarden landbouw'!$E$50:$E$60)\n)\n)\n),\n\"\"))","v":"-"},{"$f":"IF(K119=\"-\",\"-\",IF(K$79<>\"\",\nIF(OR(K119=\"n.v.t.\",K119=\"...\"),\"n.v.t.\",\nIF(K119=\"Ja\",\"hoog\",\nIF(sprinklers=0,\n_xlfn.XLOOKUP(K$79,'Grenswaarden landbouw'!$B$36:$B$46,'Grenswaarden landbouw'!$E$36:$E$46),\n_xlfn.XLOOKUP(K$79,'Grenswaarden landbouw'!$B$50:$B$60,'Grenswaarden landbouw'!$E$50:$E$60)\n)\n)\n),\n\"\"))","v":"-"},{"$f":"IF(L119=\"-\",\"-\",IF(L$79<>\"\",\nIF(OR(L119=\"n.v.t.\",L119=\"...\"),\"n.v.t.\",\nIF(L119=\"Ja\",\"hoog\",\nIF(sprinklers=0,\n_xlfn.XLOOKUP(L$79,'Grenswaarden landbouw'!$B$36:$B$46,'Grenswaarden landbouw'!$E$36:$E$46),\n_xlfn.XLOOKUP(L$79,'Grenswaarden landbouw'!$B$50:$B$60,'Grenswaarden landbouw'!$E$50:$E$60)\n)\n)\n),\n\"\"))","v":"-"},{"$f":"IF(M119=\"-\",\"-\",IF(M$79<>\"\",\nIF(OR(M119=\"n.v.t.\",M119=\"...\"),\"n.v.t.\",\nIF(M119=\"Ja\",\"hoog\",\nIF(sprinklers=0,\n_xlfn.XLOOKUP(M$79,'Grenswaarden landbouw'!$B$36:$B$46,'Grenswaarden landbouw'!$E$36:$E$46),\n_xlfn.XLOOKUP(M$79,'Grenswaarden landbouw'!$B$50:$B$60,'Grenswaarden landbouw'!$E$50:$E$60)\n)\n)\n),\n\"\"))","v":"-"},{"$f":"IF(N119=\"-\",\"-\",IF(N$79<>\"\",\nIF(OR(N119=\"n.v.t.\",N119=\"...\"),\"n.v.t.\",\nIF(N119=\"Ja\",\"hoog\",\nIF(sprinklers=0,\n_xlfn.XLOOKUP(N$79,'Grenswaarden landbouw'!$B$36:$B$46,'Grenswaarden landbouw'!$E$36:$E$46),\n_xlfn.XLOOKUP(N$79,'Grenswaarden landbouw'!$B$50:$B$60,'Grenswaarden landbouw'!$E$50:$E$60)\n)\n)\n),\n\"\"))","v":"-"}]
[null,null,"Tijdens de vegetatieve groei",{"$f":"IF(D120=\"-\",\"-\",IF(D$79<>\"\",\nIF(OR(D120=\"n.v.t.\",D120=\"...\"),\"onbekend\",\nIF(D120=\"Ja\",\"hoog\",\nIF(sprinklers=0,\n_xlfn.XLOOKUP(D$79,'Grenswaarden landbouw'!$B$36:$B$46,'Grenswaarden landbouw'!$F$36:$F$46),\n_xlfn.XLOOKUP(D$79,'Grenswaarden landbouw'!$B$50:$B$60,'Grenswaarden landbouw'!$F$50:$F$60)\n)\n)\n),\n\"\"))","v":"-"},{"$f":"IF(E120=\"-\",\"-\",IF(E$79<>\"\",\nIF(OR(E120=\"n.v.t.\",E120=\"...\"),\"onbekend\",\nIF(E120=\"Ja\",\"hoog\",\nIF(sprinklers=0,\n_xlfn.XLOOKUP(E$79,'Grenswaarden landbouw'!$B$36:$B$46,'Grenswaarden landbouw'!$F$36:$F$46),\n_xlfn.XLOOKUP(E$79,'Grenswaarden landbouw'!$B$50:$B$60,'Grenswaarden landbouw'!$F$50:$F$60)\n)\n)\n),\n\"\"))","v":"-"},{"$f":"IF(F120=\"-\",\"-\",IF(F$79<>\"\",\nIF(OR(F120=\"n.v.t.\",F120=\"...\"),\"onbekend\",\nIF(F120=\"Ja\",\"hoog\",\nIF(sprinklers=0,\n_xlfn.XLOOKUP(F$79,'Grenswaarden landbouw'!$B$36:$B$46,'Grenswaarden landbouw'!$F$36:$F$46),\n_xlfn.XLOOKUP(F$79,'Grenswaarden landbouw'!$B$50:$B$60,'Grenswaarden landbouw'!$F$50:$F$60)\n)\n)\n),\n\"\"))","v":"-"},{"$f":"IF(G120=\"-\",\"-\",IF(G$79<>\"\",\nIF(OR(G120=\"n.v.t.\",G120=\"...\"),\"onbekend\",\nIF(G120=\"Ja\",\"hoog\",\nIF(sprinklers=0,\n_xlfn.XLOOKUP(G$79,'Grenswaarden landbouw'!$B$36:$B$46,'Grenswaarden landbouw'!$F$36:$F$46),\n_xlfn.XLOOKUP(G$79,'Grenswaarden landbouw'!$B$50:$B$60,'Grenswaarden landbouw'!$F$50:$F$60)\n)\n)\n),\n\"\"))","v":"-"},{"$f":"IF(H120=\"-\",\"-\",IF(H$79<>\"\",\nIF(OR(H120=\"n.v.t.\",H120=\"...\"),\"onbekend\",\nIF(H120=\"Ja\",\"hoog\",\nIF(sprinklers=0,\n_xlfn.XLOOKUP(H$79,'Grenswaarden landbouw'!$B$36:$B$46,'Grenswaarden landbouw'!$F$36:$F$46),\n_xlfn.XLOOKUP(H$79,'Grenswaarden landbouw'!$B$50:$B$60,'Grenswaarden landbouw'!$F$50:$F$60)\n)\n)\n),\n\"\"))","v":"-"},{"$f":"IF(I120=\"-\",\"-\",IF(I$79<>\"\",\nIF(OR(I120=\"n.v.t.\",I120=\"...\"),\"onbekend\",\nIF(I120=\"Ja\",\"hoog\",\nIF(sprinklers=0,\n_xlfn.XLOOKUP(I$79,'Grenswaarden landbouw'!$B$36:$B$46,'Grenswaarden landbouw'!$F$36:$F$46),\n_xlfn.XLOOKUP(I$79,'Grenswaarden landbouw'!$B$50:$B$60,'Grenswaarden landbouw'!$F$50:$F$60)\n)\n)\n),\n\"\"))","v":"-"},{"$f":"IF(J120=\"-\",\"-\",IF(J$79<>\"\",\nIF(OR(J120=\"n.v.t.\",J120=\"...\"),\"onbekend\",\nIF(J120=\"Ja\",\"hoog\",\nIF(sprinklers=0,\n_xlfn.XLOOKUP(J$79,'Grenswaarden landbouw'!$B$36:$B$46,'Grenswaarden landbouw'!$F$36:$F$46),\n_xlfn.XLOOKUP(J$79,'Grenswaarden landbouw'!$B$50:$B$60,'Grenswaarden landbouw'!$F$50:$F$60)\n)\n)\n),\n\"\"))","v":"-"},{"$f":"IF(K120=\"-\",\"-\",IF(K$79<>\"\",\nIF(OR(K120=\"n.v.t.\",K120=\"...\"),\"onbekend\",\nIF(K120=\"Ja\",\"hoog\",\nIF(sprinklers=0,\n_xlfn.XLOOKUP(K$79,'Grenswaarden landbouw'!$B$36:$B$46,'Grenswaarden landbouw'!$F$36:$F$46),\n_xlfn.XLOOKUP(K$79,'Grenswaarden landbouw'!$B$50:$B$60,'Grenswaarden landbouw'!$F$50:$F$60)\n)\n)\n),\n\"\"))","v":"-"},{"$f":"IF(L120=\"-\",\"-\",IF(L$79<>\"\",\nIF(OR(L120=\"n.v.t.\",L120=\"...\"),\"onbekend\",\nIF(L120=\"Ja\",\"hoog\",\nIF(sprinklers=0,\n_xlfn.XLOOKUP(L$79,'Grenswaarden landbouw'!$B$36:$B$46,'Grenswaarden landbouw'!$F$36:$F$46),\n_xlfn.XLOOKUP(L$79,'Grenswaarden landbouw'!$B$50:$B$60,'Grenswaarden landbouw'!$F$50:$F$60)\n)\n)\n),\n\"\"))","v":"-"},{"$f":"IF(M120=\"-\",\"-\",IF(M$79<>\"\",\nIF(OR(M120=\"n.v.t.\",M120=\"...\"),\"onbekend\",\nIF(M120=\"Ja\",\"hoog\",\nIF(sprinklers=0,\n_xlfn.XLOOKUP(M$79,'Grenswaarden landbouw'!$B$36:$B$46,'Grenswaarden landbouw'!$F$36:$F$46),\n_xlfn.XLOOKUP(M$79,'Grenswaarden landbouw'!$B$50:$B$60,'Grenswaarden landbouw'!$F$50:$F$60)\n)\n)\n),\n\"\"))","v":"-"},{"$f":"IF(N120=\"-\",\"-\",IF(N$79<>\"\",\nIF(OR(N120=\"n.v.t.\",N120=\"...\"),\"onbekend\",\nIF(N120=\"Ja\",\"hoog\",\nIF(sprinklers=0,\n_xlfn.XLOOKUP(N$79,'Grenswaarden landbouw'!$B$36:$B$46,'Grenswaarden landbouw'!$F$36:$F$46),\n_xlfn.XLOOKUP(N$79,'Grenswaarden landbouw'!$B$50:$B$60,'Grenswaarden landbouw'!$F$50:$F$60)\n)\n)\n),\n\"\"))","v":"-"}]
[null,null,"Tijdens de oogst",{"$f":"IF(D121=\"-\",\"-\",IF(D$79<>\"\",\nIF(OR(D121=\"n.v.t.\",D121=\"...\"),\"onbekend\",\nIF(D121=\"Ja\",\"hoog\",\nIF(sprinklers=0,\n_xlfn.XLOOKUP(D$79,'Grenswaarden landbouw'!$B$36:$B$46,'Grenswaarden landbouw'!$G$36:$G$46),\n_xlfn.XLOOKUP(D$79,'Grenswaarden landbouw'!$B$50:$B$60,'Grenswaarden landbouw'!$G$50:$G$60)\n)\n)\n),\n\"\"))","v":"-"},{"$f":"IF(E121=\"-\",\"-\",IF(E$79<>\"\",\nIF(OR(E121=\"n.v.t.\",E121=\"...\"),\"onbekend\",\nIF(E121=\"Ja\",\"hoog\",\nIF(sprinklers=0,\n_xlfn.XLOOKUP(E$79,'Grenswaarden landbouw'!$B$36:$B$46,'Grenswaarden landbouw'!$G$36:$G$46),\n_xlfn.XLOOKUP(E$79,'Grenswaarden landbouw'!$B$50:$B$60,'Grenswaarden landbouw'!$G$50:$G$60)\n)\n)\n),\n\"\"))","v":"-"},{"$f":"IF(F121=\"-\",\"-\",IF(F$79<>\"\",\nIF(OR(F121=\"n.v.t.\",F121=\"...\"),\"onbekend\",\nIF(F121=\"Ja\",\"hoog\",\nIF(sprinklers=0,\n_xlfn.XLOOKUP(F$79,'Grenswaarden landbouw'!$B$36:$B$46,'Grenswaarden landbouw'!$G$36:$G$46),\n_xlfn.XLOOKUP(F$79,'Grenswaarden landbouw'!$B$50:$B$60,'Grenswaarden landbouw'!$G$50:$G$60)\n)\n)\n),\n\"\"))","v":"-"},{"$f":"IF(G121=\"-\",\"-\",IF(G$79<>\"\",\nIF(OR(G121=\"n.v.t.\",G121=\"...\"),\"onbekend\",\nIF(G121=\"Ja\",\"hoog\",\nIF(sprinklers=0,\n_xlfn.XLOOKUP(G$79,'Grenswaarden landbouw'!$B$36:$B$46,'Grenswaarden landbouw'!$G$36:$G$46),\n_xlfn.XLOOKUP(G$79,'Grenswaarden landbouw'!$B$50:$B$60,'Grenswaarden landbouw'!$G$50:$G$60)\n)\n)\n),\n\"\"))","v":"-"},{"$f":"IF(H121=\"-\",\"-\",IF(H$79<>\"\",\nIF(OR(H121=\"n.v.t.\",H121=\"...\"),\"onbekend\",\nIF(H121=\"Ja\",\"hoog\",\nIF(sprinklers=0,\n_xlfn.XLOOKUP(H$79,'Grenswaarden landbouw'!$B$36:$B$46,'Grenswaarden landbouw'!$G$36:$G$46),\n_xlfn.XLOOKUP(H$79,'Grenswaarden landbouw'!$B$50:$B$60,'Grenswaarden landbouw'!$G$50:$G$60)\n)\n)\n),\n\"\"))","v":"-"},{"$f":"IF(I121=\"-\",\"-\",IF(I$79<>\"\",\nIF(OR(I121=\"n.v.t.\",I121=\"...\"),\"onbekend\",\nIF(I121=\"Ja\",\"hoog\",\nIF(sprinklers=0,\n_xlfn.XLOOKUP(I$79,'Grenswaarden landbouw'!$B$36:$B$46,'Grenswaarden landbouw'!$G$36:$G$46),\n_xlfn.XLOOKUP(I$79,'Grenswaarden landbouw'!$B$50:$B$60,'Grenswaarden landbouw'!$G$50:$G$60)\n)\n)\n),\n\"\"))","v":"-"},{"$f":"IF(J121=\"-\",\"-\",IF(J$79<>\"\",\nIF(OR(J121=\"n.v.t.\",J121=\"...\"),\"onbekend\",\nIF(J121=\"Ja\",\"hoog\",\nIF(sprinklers=0,\n_xlfn.XLOOKUP(J$79,'Grenswaarden landbouw'!$B$36:$B$46,'Grenswaarden landbouw'!$G$36:$G$46),\n_xlfn.XLOOKUP(J$79,'Grenswaarden landbouw'!$B$50:$B$60,'Grenswaarden landbouw'!$G$50:$G$60)\n)\n)\n),\n\"\"))","v":"-"},{"$f":"IF(K121=\"-\",\"-\",IF(K$79<>\"\",\nIF(OR(K121=\"n.v.t.\",K121=\"...\"),\"onbekend\",\nIF(K121=\"Ja\",\"hoog\",\nIF(sprinklers=0,\n_xlfn.XLOOKUP(K$79,'Grenswaarden landbouw'!$B$36:$B$46,'Grenswaarden landbouw'!$G$36:$G$46),\n_xlfn.XLOOKUP(K$79,'Grenswaarden landbouw'!$B$50:$B$60,'Grenswaarden landbouw'!$G$50:$G$60)\n)\n)\n),\n\"\"))","v":"-"},{"$f":"IF(L121=\"-\",\"-\",IF(L$79<>\"\",\nIF(OR(L121=\"n.v.t.\",L121=\"...\"),\"onbekend\",\nIF(L121=\"Ja\",\"hoog\",\nIF(sprinklers=0,\n_xlfn.XLOOKUP(L$79,'Grenswaarden landbouw'!$B$36:$B$46,'Grenswaarden landbouw'!$G$36:$G$46),\n_xlfn.XLOOKUP(L$79,'Grenswaarden landbouw'!$B$50:$B$60,'Grenswaarden landbouw'!$G$50:$G$60)\n)\n)\n),\n\"\"))","v":"-"},{"$f":"IF(M121=\"-\",\"-\",IF(M$79<>\"\",\nIF(OR(M121=\"n.v.t.\",M121=\"...\"),\"onbekend\",\nIF(M121=\"Ja\",\"hoog\",\nIF(sprinklers=0,\n_xlfn.XLOOKUP(M$79,'Grenswaarden landbouw'!$B$36:$B$46,'Grenswaarden landbouw'!$G$36:$G$46),\n_xlfn.XLOOKUP(M$79,'Grenswaarden landbouw'!$B$50:$B$60,'Grenswaarden landbouw'!$G$50:$G$60)\n)\n)\n),\n\"\"))","v":"-"},{"$f":"IF(N121=\"-\",\"-\",IF(N$79<>\"\",\nIF(OR(N121=\"n.v.t.\",N121=\"...\"),\"onbekend\",\nIF(N121=\"Ja\",\"hoog\",\nIF(sprinklers=0,\n_xlfn.XLOOKUP(N$79,'Grenswaarden landbouw'!$B$36:$B$46,'Grenswaarden landbouw'!$G$36:$G$46),\n_xlfn.XLOOKUP(N$79,'Grenswaarden landbouw'!$B$50:$B$60,'Grenswaarden landbouw'!$G$50:$G$60)\n)\n)\n),\n\"\"))","v":"-"}]
[]
[null,null,"Risico totaal",{"$f":"IF(D$41<>\"\", IF(D$83=\"hoog\", \"hoog\", IF(COUNTIF(D125:D129, \"hoog\") > 0, \"hoog\", IF(COUNTIF(D125:D129, \"midden\") > 0, \"midden\", IF(COUNTIF(D125:D129, \"laag\") > 0, \"laag\", \"-\")))), \"-\")","v":"-"},{"$f":"IF(E$41<>\"\", IF(E$83=\"hoog\", \"hoog\", IF(COUNTIF(E125:E129, \"hoog\") > 0, \"hoog\", IF(COUNTIF(E125:E129, \"midden\") > 0, \"midden\", IF(COUNTIF(E125:E129, \"laag\") > 0, \"laag\", \"-\")))), \"-\")","v":"-"},"-","-","-","-","-","-","-","-","-"]
[null,null,"Het hoogste risico is leidend. Het is aan de gebruiker om in te schatten of dit risico niveau van toepassing is op hun projectgebied. Ter illustratie: een doelgewas kan een hoog/hoger risico hebben tijdens de kiemfase, maar deze fase treedt in het jaar bijvoorbeeld met name op wanneer de kans op verzilting heel klein is. Hierdoor kan het eindrisico (o.b.v. een deskundigenoordeel) lager uitvallen."]
[]
[]
[]
["  BLOK 4: RISICO'S DOELGEWASSEN                                                                  BLOK 4: RISICO'S DOELGEWASSEN                                                                  BLOK 4: RISICO'S DOELGEWASSEN\n- TOEKOMSTIGE SITUATIE -                                                                              - TOEKOMSTIGE SITUATIE -                                                                              - TOEKOMSTIGE SITUATIE -   "]
[null,null,"Oordeelsblok 2. zoutgehalte toekomstige situatie (verstoring/fysieke ingreep)",null,null,"maximaal zoutgehalte verstoring:",{"$f":"IF(verstoring_type=\"Verzilting\",IF(bool_opp_irrigatie=\"Ja\",\n    IF(maximaal_zoutgehalte_toekomst<>\"\", maximaal_zoutgehalte_toekomst, \"niet opgegeven\"),\n    IF(bool_opp_irrigatie=\"Nee\",\n        IF(maximaal_zoutgehalte_toekomst_irrigatie<>\"\", maximaal_zoutgehalte_toekomst_irrigatie, \"niet opgegeven\"),\n        \"niet opgegeven\"\n    )\n),\"niet opgegeven\")","v":"niet opgegeven"},{"$f":"IF(R38=1,\"dS/m\",IF(R38=2,\"mg Cl/l\",\"eenheid onbekend\"))","v":"eenheid onbekend"},null,null,"N.B.: De huidige situatie wordt beoordeeld in BLOK 3."]
[]
[null,null,{"$f":"IF(LEFT(bool_toets_verstoring,2)=\"Ja\",\"In dit blok wordt een overzicht gegeven in hoeverre er door de verstoring aanleidingen zijn voor risico's t.a.v. verzilting.\",\"U heeft (nog) niet gekozen om een verstoring of fysieke ingreep te toetsen. Daarom wordt in dit blok geen beoordeling opgesteld.\")","v":"U heeft (nog) niet gekozen om een verstoring of fysieke ingreep te toetsen. Daarom wordt in dit blok geen beoordeling opgesteld."},null,null,null,null,{"$f":"IF(G72=0,\"Vul eerst een waarde voor zoutgehalte in op tabblad 1. Algemeen en op tabblad 2. Landbouw.\",\"\")","v":""}]
[null,null,"De beoordeling geschiedt op dezelfde manier als oordeelsblok 1 hierboven.",null,null,null,null,null,null,null,null,null,null,null,null,null,null,null,{"$f":"IF(LEFT(bool_toets_verstoring,2)=\"Ja\",1,0)","v":0}]
[null,null,"Als zoutgehalte voor de verstoring wordt de maximale waarde van het irrigatiewater gebruikt. Voor referentie is deze waarde in de hierboven blauwe cel aangegeven.",null,null,null,null,null,null,null,null,null,null,null,null,null,null,null,0]
[null,null,"Doelgewassen",{"$f":"TRANSPOSE(_xlfn._xlws.FILTER('2. Landbouw'!C10:C20,'2. Landbouw'!F10:F20=TRUE,\"geen selectie gemaakt\"))","v":"geen selectie gemaakt"},null,null,null,null,null,null,null,null,null,null,null,null,null,null,0]
[null,null,null,null,null,null,null,null,null,null,null,null,null,null,null,null,null,null,0]
[null,null,null,null,null,null,null,null,null,null,null,null,null,null,null,null,null,null,0]
[null,null,"Bandbreedte \"normaal\"",null,null,null,null,null,null,null,null,null,null,null,null,null,null,null,0]
[null,null,"Als het watervolume en de bodemstructuur een laag risico hebben, beschouw dan de risico's binnen de bandbreedte \"normaal\". Dit is effectief rekenen met het bodemtype dat u heeft ingevuld.",null,null,null,null,null,null,null,null,null,null,null,null,null,null,null,0]
[null,null,"Als het watervolume een midden of hoog risico heeft, beschouw dan de bandbreedte \"conservatief\".",null,null,null,null,null,null,null,null,null,null,null,null,null,null,null,0]
[null,null,null,null,null,null,null,null,null,null,null,null,null,null,null,null,null,null,0]
[null,null,"Overschrijding grenswaarde zoutgehalte",null,null,null,null,null,null,null,null,null,null,null,null,null,null,null,0]
[null,null,"Hier wordt getest of het zoutgehalte van het irrigatiewater t.g.v. een verstoring aanleiding geeft voor een risico t.a.v. effecten door verzilting. Hiervoor wordt de maximale waarde van het zoutgehalte gebruikt.",null,null,null,null,null,null,null,null,null,null,null,null,null,null,null,0]
[null,null,"Algemeen voor het doelgewas",{"$f":"IF(D$142<>\"\",IF(OR($G$137=0,$G$137=\"niet opgegeven\"),\"-\",IF(D53=\"\",\"-\",IF($G$137>D53,\"Ja\",IF(D53=\"n.v.t.\",\"n.v.t.\",\"Nee\")))),\"-\")","v":"-"},{"$f":"IF(E$142<>\"\",IF(OR($G$137=0,$G$137=\"niet opgegeven\"),\"-\",IF(E53=\"\",\"-\",IF($G$137>E53,\"Ja\",IF(E53=\"n.v.t.\",\"n.v.t.\",\"Nee\")))),\"-\")","v":"-"},"-","-","-","-","-","-","-","-","-",null,null,null,null,0]
[null,null,"Tijdens de kiemfase",{"$f":"IF(D$142<>\"\",IF(OR($G$137=0,$G$137=\"niet opgegeven\"),\"-\",IF(D54=\"\",\"-\",IF($G$137>D54,\"Ja\",IF(D54=\"n.v.t.\",\"n.v.t.\",\"Nee\")))),\"-\")","v":"-"},"-","-","-","-","-","-","-","-","-","-",null,null,null,null,0]
[null,null,"Tijdens de zaailingfase","-","-","-","-","-","-","-","-","-","-","-",null,null,null,null,0]
[null,null,"Tijdens de vegetatieve groei","-","-","-","-","-","-","-","-","-","-","-",null,null,null,null,0]
[null,null,"Tijdens de oogst","-","-","-","-","-","-","-","-","-","-","-",null,null,null,null,0]
[null,null,null,null,null,null,null,null,null,null,null,null,null,null,null,null,null,null,0]
[null,null,"Risico zoutgehalte",null,null,null,null,null,null,null,null,null,null,null,null,null,null,null,0]
[null,null,"Beoordeling o.b.v. zouttolerantie (gevoelig = hoog, matig tolerant = midden, tolerant = laag). Overschrijding van de zouttolerantie en een hoog risico op waardevermindering leiden per definitie tot een hoog risico. Irrigatie op het blad verhoogt het risico met 1 niveau.",null,null,null,null,null,null,null,null,null,null,null,null,null,null,null,0]
[null,null,"Algemeen voor het doelgewas",{"$f":"IF(D151=\"-\",\"-\",IF(D$142<>\"\",\n    IF(OR(D151=\"n.v.t.\",D151=\"...\"), \"n.v.t.\",\n        IF(D151=\"Ja\", \"hoog\",\n            IF(sprinklers=0,\n                _xlfn.XLOOKUP(D$142, 'Grenswaarden landbouw'!$B$36:$B$46, 'Grenswaarden landbouw'!$C$36:$C$46),\n                _xlfn.XLOOKUP(D$142, 'Grenswaarden landbouw'!$B$50:$B$60, 'Grenswaarden landbouw'!$C$50:$C$60)\n            )\n        )\n    ),\n\"\"))","v":"-"},{"$f":"IF(E151=\"-\",\"-\",IF(E$142<>\"\",\n    IF(OR(E151=\"n.v.t.\",E151=\"...\"), \"n.v.t.\",\n        IF(E151=\"Ja\", \"hoog\",\n            IF(sprinklers=0,\n                _xlfn.XLOOKUP(E$142, 'Grenswaarden landbouw'!$B$36:$B$46, 'Grenswaarden landbouw'!$C$36:$C$46),\n                _xlfn.XLOOKUP(E$142, 'Grenswaarden landbouw'!$B$50:$B$60, 'Grenswaarden landbouw'!$C$50:$C$60)\n            )\n        )\n    ),\n\"\"))","v":"-"},{"$f":"IF(F151=\"-\",\"-\",IF(F$142<>\"\",\n    IF(OR(F151=\"n.v.t.\",F151=\"...\"), \"n.v.t.\",\n        IF(F151=\"Ja\", \"hoog\",\n            IF(sprinklers=0,\n                _xlfn.XLOOKUP(F$142, 'Grenswaarden landbouw'!$B$36:$B$46, 'Grenswaarden landbouw'!$C$36:$C$46),\n                _xlfn.XLOOKUP(F$142, 'Grenswaarden landbouw'!$B$50:$B$60, 'Grenswaarden landbouw'!$C$50:$C$60)\n            )\n        )\n    ),\n\"\"))","v":"-"},{"$f":"IF(G151=\"-\",\"-\",IF(G$142<>\"\",\n    IF(OR(G151=\"n.v.t.\",G151=\"...\"), \"n.v.t.\",\n        IF(G151=\"Ja\", \"hoog\",\n            IF(sprinklers=0,\n                _xlfn.XLOOKUP(G$142, 'Grenswaarden landbouw'!$B$36:$B$46, 'Grenswaarden landbouw'!$C$36:$C$46),\n                _xlfn.XLOOKUP(G$142, 'Grenswaarden landbouw'!$B$50:$B$60, 'Grenswaarden landbouw'!$C$50:$C$60)\n            )\n        )\n    ),\n\"\"))","v":"-"},{"$f":"IF(H151=\"-\",\"-\",IF(H$142<>\"\",\n    IF(OR(H151=\"n.v.t.\",H151=\"...\"), \"n.v.t.\",\n        IF(H151=\"Ja\", \"hoog\",\n            IF(sprinklers=0,\n                _xlfn.XLOOKUP(H$142, 'Grenswaarden landbouw'!$B$36:$B$46, 'Grenswaarden landbouw'!$C$36:$C$46),\n                _xlfn.XLOOKUP(H$142, 'Grenswaarden landbouw'!$B$50:$B$60, 'Grenswaarden landbouw'!$C$50:$C$60)\n            )\n        )\n    ),\n\"\"))","v":"-"},{"$f":"IF(I151=\"-\",\"-\",IF(I$142<>\"\",\n    IF(OR(I151=\"n.v.t.\",I151=\"...\"), \"n.v.t.\",\n        IF(I151=\"Ja\", \"hoog\",\n            IF(sprinklers=0,\n                _xlfn.XLOOKUP(I$142, 'Grenswaarden landbouw'!$B$36:$B$46, 'Grenswaarden landbouw'!$C$36:$C$46),\n                _xlfn.XLOOKUP(I$142, 'Grenswaarden landbouw'!$B$50:$B$60, 'Grenswaarden landbouw'!$C$50:$C$60)\n            )\n        )\n    ),\n\"\"))","v":"-"},{"$f":"IF(J151=\"-\",\"-\",IF(J$142<>\"\",\n    IF(OR(J151=\"n.v.t.\",J151=\"...\"), \"n.v.t.\",\n        IF(J151=\"Ja\", \"hoog\",\n            IF(sprinklers=0,\n                _xlfn.XLOOKUP(J$142, 'Grenswaarden landbouw'!$B$36:$B$46, 'Grenswaarden landbouw'!$C$36:$C$46),\n                _xlfn.XLOOKUP(J$142, 'Grenswaarden landbouw'!$B$50:$B$60, 'Grenswaarden landbouw'!$C$50:$C$60)\n            )\n        )\n    ),\n\"\"))","v":"-"},{"$f":"IF(K151=\"-\",\"-\",IF(K$142<>\"\",\n    IF(OR(K151=\"n.v.t.\",K151=\"...\"), \"n.v.t.\",\n        IF(K151=\"Ja\", \"hoog\",\n            IF(sprinklers=0,\n                _xlfn.XLOOKUP(K$142, 'Grenswaarden landbouw'!$B$36:$B$46, 'Grenswaarden landbouw'!$C$36:$C$46),\n                _xlfn.XLOOKUP(K$142, 'Grenswaarden landbouw'!$B$50:$B$60, 'Grenswaarden landbouw'!$C$50:$C$60)\n            )\n        )\n    ),\n\"\"))","v":"-"},{"$f":"IF(L151=\"-\",\"-\",IF(L$142<>\"\",\n    IF(OR(L151=\"n.v.t.\",L151=\"...\"), \"n.v.t.\",\n        IF(L151=\"Ja\", \"hoog\",\n            IF(sprinklers=0,\n                _xlfn.XLOOKUP(L$142, 'Grenswaarden landbouw'!$B$36:$B$46, 'Grenswaarden landbouw'!$C$36:$C$46),\n                _xlfn.XLOOKUP(L$142, 'Grenswaarden landbouw'!$B$50:$B$60, 'Grenswaarden landbouw'!$C$50:$C$60)\n            )\n        )\n    ),\n\"\"))","v":"-"},{"$f":"IF(M151=\"-\",\"-\",IF(M$142<>\"\",\n    IF(OR(M151=\"n.v.t.\",M151=\"...\"), \"n.v.t.\",\n        IF(M151=\"Ja\", \"hoog\",\n            IF(sprinklers=0,\n                _xlfn.XLOOKUP(M$142, 'Grenswaarden landbouw'!$B$36:$B$46, 'Grenswaarden landbouw'!$C$36:$C$46),\n                _xlfn.XLOOKUP(M$142, 'Grenswaarden landbouw'!$B$50:$B$60, 'Grenswaarden landbouw'!$C$50:$C$60)\n            )\n        )\n    ),\n\"\"))","v":"-"},{"$f":"IF(N151=\"-\",\"-\",IF(N$142<>\"\",\n    IF(OR(N151=\"n.v.t.\",N151=\"...\"), \"n.v.t.\",\n        IF(N151=\"Ja\", \"hoog\",\n            IF(sprinklers=0,\n                _xlfn.XLOOKUP(N$142, 'Grenswaarden landbouw'!$B$36:$B$46, 'Grenswaarden landbouw'!$C$36:$C$46),\n                _xlfn.XLOOKUP(N$142, 'Grenswaarden landbouw'!$B$50:$B$60, 'Grenswaarden landbouw'!$C$50:$C$60)\n            )\n        )\n    ),\n\"\"))","v":"-"},null,null,null,null,0]
[null,null,"Tijdens de kiemfase",{"$f":"IF(D152=\"-\",\"-\",IF(D$142<>\"\",\n    IF(OR(D152=\"n.v.t.\",D152=\"...\"), \"n.v.t.\",\n        IF(D152=\"Ja\", \"hoog\",\n            IF(sprinklers=0,\n                _xlfn.XLOOKUP(D$142, 'Grenswaarden landbouw'!$B$36:$B$46, 'Grenswaarden landbouw'!$D$36:$D$46),\n                _xlfn.XLOOKUP(D$142, 'Grenswaarden landbouw'!$B$50:$B$60, 'Grenswaarden landbouw'!$D$50:$D$60)\n            )\n        )\n    ),\n\"\"))","v":"-"},{"$f":"IF(E152=\"-\",\"-\",IF(E$142<>\"\",\n    IF(OR(E152=\"n.v.t.\",E152=\"...\"), \"n.v.t.\",\n        IF(E152=\"Ja\", \"hoog\",\n            IF(sprinklers=0,\n                _xlfn.XLOOKUP(E$142, 'Grenswaarden landbouw'!$B$36:$B$46, 'Grenswaarden landbouw'!$D$36:$D$46),\n                _xlfn.XLOOKUP(E$142, 'Grenswaarden landbouw'!$B$50:$B$60, 'Grenswaarden landbouw'!$D$50:$D$60)\n            )\n        )\n    ),\n\"\"))","v":"-"},{"$f":"IF(F152=\"-\",\"-\",IF(F$142<>\"\",\n    IF(OR(F152=\"n.v.t.\",F152=\"...\"), \"n.v.t.\",\n        IF(F152=\"Ja\", \"hoog\",\n            IF(sprinklers=0,\n                _xlfn.XLOOKUP(F$142, 'Grenswaarden landbouw'!$B$36:$B$46, 'Grenswaarden landbouw'!$D$36:$D$46),\n                _xlfn.XLOOKUP(F$142, 'Grenswaarden landbouw'!$B$50:$B$60, 'Grenswaarden landbouw'!$D$50:$D$60)\n            )\n        )\n    ),\n\"\"))","v":"-"},{"$f":"IF(G152=\"-\",\"-\",IF(G$142<>\"\",\n    IF(OR(G152=\"n.v.t.\",G152=\"...\"), \"n.v.t.\",\n        IF(G152=\"Ja\", \"hoog\",\n            IF(sprinklers=0,\n                _xlfn.XLOOKUP(G$142, 'Grenswaarden landbouw'!$B$36:$B$46, 'Grenswaarden landbouw'!$D$36:$D$46),\n                _xlfn.XLOOKUP(G$142, 'Grenswaarden landbouw'!$B$50:$B$60, 'Grenswaarden landbouw'!$D$50:$D$60)\n            )\n        )\n    ),\n\"\"))","v":"-"},{"$f":"IF(H152=\"-\",\"-\",IF(H$142<>\"\",\n    IF(OR(H152=\"n.v.t.\",H152=\"...\"), \"n.v.t.\",\n        IF(H152=\"Ja\", \"hoog\",\n            IF(sprinklers=0,\n                _xlfn.XLOOKUP(H$142, 'Grenswaarden landbouw'!$B$36:$B$46, 'Grenswaarden landbouw'!$D$36:$D$46),\n                _xlfn.XLOOKUP(H$142, 'Grenswaarden landbouw'!$B$50:$B$60, 'Grenswaarden landbouw'!$D$50:$D$60)\n            )\n        )\n    ),\n\"\"))","v":"-"},{"$f":"IF(I152=\"-\",\"-\",IF(I$142<>\"\",\n    IF(OR(I152=\"n.v.t.\",I152=\"...\"), \"n.v.t.\",\n        IF(I152=\"Ja\", \"hoog\",\n            IF(sprinklers=0,\n                _xlfn.XLOOKUP(I$142, 'Grenswaarden landbouw'!$B$36:$B$46, 'Grenswaarden landbouw'!$D$36:$D$46),\n                _xlfn.XLOOKUP(I$142, 'Grenswaarden landbouw'!$B$50:$B$60, 'Grenswaarden landbouw'!$D$50:$D$60)\n            )\n        )\n    ),\n\"\"))","v":"-"},{"$f":"IF(J152=\"-\",\"-\",IF(J$142<>\"\",\n    IF(OR(J152=\"n.v.t.\",J152=\"...\"), \"n.v.t.\",\n        IF(J152=\"Ja\", \"hoog\",\n            IF(sprinklers=0,\n                _xlfn.XLOOKUP(J$142, 'Grenswaarden landbouw'!$B$36:$B$46, 'Grenswaarden landbouw'!$D$36:$D$46),\n                _xlfn.XLOOKUP(J$142, 'Grenswaarden landbouw'!$B$50:$B$60, 'Grenswaarden landbouw'!$D$50:$D$60)\n            )\n        )\n    ),\n\"\"))","v":"-"},{"$f":"IF(K152=\"-\",\"-\",IF(K$142<>\"\",\n    IF(OR(K152=\"n.v.t.\",K152=\"...\"), \"n.v.t.\",\n        IF(K152=\"Ja\", \"hoog\",\n            IF(sprinklers=0,\n                _xlfn.XLOOKUP(K$142, 'Grenswaarden landbouw'!$B$36:$B$46, 'Grenswaarden landbouw'!$D$36:$D$46),\n                _xlfn.XLOOKUP(K$142, 'Grenswaarden landbouw'!$B$50:$B$60, 'Grenswaarden landbouw'!$D$50:$D$60)\n            )\n        )\n    ),\n\"\"))","v":"-"},{"$f":"IF(L152=\"-\",\"-\",IF(L$142<>\"\",\n    IF(OR(L152=\"n.v.t.\",L152=\"...\"), \"n.v.t.\",\n        IF(L152=\"Ja\", \"hoog\",\n            IF(sprinklers=0,\n                _xlfn.XLOOKUP(L$142, 'Grenswaarden landbouw'!$B$36:$B$46, 'Grenswaarden landbouw'!$D$36:$D$46),\n                _xlfn.XLOOKUP(L$142, 'Grenswaarden landbouw'!$B$50:$B$60, 'Grenswaarden landbouw'!$D$50:$D$60)\n            )\n        )\n    ),\n\"\"))","v":"-"},{"$f":"IF(M152=\"-\",\"-\",IF(M$142<>\"\",\n    IF(OR(M152=\"n.v.t.\",M152=\"...\"), \"n.v.t.\",\n        IF(M152=\"Ja\", \"hoog\",\n            IF(sprinklers=0,\n                _xlfn.XLOOKUP(M$142, 'Grenswaarden landbouw'!$B$36:$B$46, 'Grenswaarden landbouw'!$D$36:$D$46),\n                _xlfn.XLOOKUP(M$142, 'Grenswaarden landbouw'!$B$50:$B$60, 'Grenswaarden landbouw'!$D$50:$D$60)\n            )\n        )\n    ),\n\"\"))","v":"-"},{"$f":"IF(N152=\"-\",\"-\",IF(N$142<>\"\",\n    IF(OR(N152=\"n.v.t.\",N152=\"...\"), \"n.v.t.\",\n        IF(N152=\"Ja\", \"hoog\",\n            IF(sprinklers=0,\n                _xlfn.XLOOKUP(N$142, 'Grenswaarden landbouw'!$B$36:$B$46, 'Grenswaarden landbouw'!$D$36:$D$46),\n                _xlfn.XLOOKUP(N$142, 'Grenswaarden landbouw'!$B$50:$B$60, 'Grenswaarden landbouw'!$D$50:$D$60)\n            )\n        )\n    ),\n\"\"))","v":"-"},null,null,null,null,0]
[null,null,"Tijdens de zaailingfase",{"$f":"IF(D153=\"-\",\"-\",IF(D$142<>\"\",\n    IF(OR(D153=\"n.v.t.\",D153=\"...\"), \"n.v.t.\",\n        IF(D153=\"Ja\", \"hoog\",\n            IF(sprinklers=0,\n                _xlfn.XLOOKUP(D$142, 'Grenswaarden landbouw'!$B$36:$B$46, 'Grenswaarden landbouw'!$E$36:$E$46),\n                _xlfn.XLOOKUP(D$142, 'Grenswaarden landbouw'!$B$50:$B$60, 'Grenswaarden landbouw'!$E$50:$E$60)\n            )\n        )\n    ),\n\"\"))","v":"-"},{"$f":"IF(E153=\"-\",\"-\",IF(E$142<>\"\",\n    IF(OR(E153=\"n.v.t.\",E153=\"...\"), \"n.v.t.\",\n        IF(E153=\"Ja\", \"hoog\",\n            IF(sprinklers=0,\n                _xlfn.XLOOKUP(E$142, 'Grenswaarden landbouw'!$B$36:$B$46, 'Grenswaarden landbouw'!$E$36:$E$46),\n                _xlfn.XLOOKUP(E$142, 'Grenswaarden landbouw'!$B$50:$B$60, 'Grenswaarden landbouw'!$E$50:$E$60)\n            )\n        )\n    ),\n\"\"))","v":"-"},{"$f":"IF(F153=\"-\",\"-\",IF(F$142<>\"\",\n    IF(OR(F153=\"n.v.t.\",F153=\"...\"), \"n.v.t.\",\n        IF(F153=\"Ja\", \"hoog\",\n            IF(sprinklers=0,\n                _xlfn.XLOOKUP(F$142, 'Grenswaarden landbouw'!$B$36:$B$46, 'Grenswaarden landbouw'!$E$36:$E$46),\n                _xlfn.XLOOKUP(F$142, 'Grenswaarden landbouw'!$B$50:$B$60, 'Grenswaarden landbouw'!$E$50:$E$60)\n            )\n        )\n    ),\n\"\"))","v":"-"},{"$f":"IF(G153=\"-\",\"-\",IF(G$142<>\"\",\n    IF(OR(G153=\"n.v.t.\",G153=\"...\"), \"n.v.t.\",\n        IF(G153=\"Ja\", \"hoog\",\n            IF(sprinklers=0,\n                _xlfn.XLOOKUP(G$142, 'Grenswaarden landbouw'!$B$36:$B$46, 'Grenswaarden landbouw'!$E$36:$E$46),\n                _xlfn.XLOOKUP(G$142, 'Grenswaarden landbouw'!$B$50:$B$60, 'Grenswaarden landbouw'!$E$50:$E$60)\n            )\n        )\n    ),\n\"\"))","v":"-"},{"$f":"IF(H153=\"-\",\"-\",IF(H$142<>\"\",\n    IF(OR(H153=\"n.v.t.\",H153=\"...\"), \"n.v.t.\",\n        IF(H153=\"Ja\", \"hoog\",\n            IF(sprinklers=0,\n                _xlfn.XLOOKUP(H$142, 'Grenswaarden landbouw'!$B$36:$B$46, 'Grenswaarden landbouw'!$E$36:$E$46),\n                _xlfn.XLOOKUP(H$142, 'Grenswaarden landbouw'!$B$50:$B$60, 'Grenswaarden landbouw'!$E$50:$E$60)\n            )\n        )\n    ),\n\"\"))","v":"-"},{"$f":"IF(I153=\"-\",\"-\",IF(I$142<>\"\",\n    IF(OR(I153=\"n.v.t.\",I153=\"...\"), \"n.v.t.\",\n        IF(I153=\"Ja\", \"hoog\",\n            IF(sprinklers=0,\n                _xlfn.XLOOKUP(I$142, 'Grenswaarden landbouw'!$B$36:$B$46, 'Grenswaarden landbouw'!$E$36:$E$46),\n                _xlfn.XLOOKUP(I$142, 'Grenswaarden landbouw'!$B$50:$B$60, 'Grenswaarden landbouw'!$E$50:$E$60)\n            )\n        )\n    ),\n\"\"))","v":"-"},{"$f":"IF(J153=\"-\",\"-\",IF(J$142<>\"\",\n    IF(OR(J153=\"n.v.t.\",J153=\"...\"), \"n.v.t.\",\n        IF(J153=\"Ja\", \"hoog\",\n            IF(sprinklers=0,\n                _xlfn.XLOOKUP(J$142, 'Grenswaarden landbouw'!$B$36:$B$46, 'Grenswaarden landbouw'!$E$36:$E$46),\n                _xlfn.XLOOKUP(J$142, 'Grenswaarden landbouw'!$B$50:$B$60, 'Grenswaarden landbouw'!$E$50:$E$60)\n            )\n        )\n    ),\n\"\"))","v":"-"},{"$f":"IF(K153=\"-\",\"-\",IF(K$142<>\"\",\n    IF(OR(K153=\"n.v.t.\",K153=\"...\"), \"n.v.t.\",\n        IF(K153=\"Ja\", \"hoog\",\n            IF(sprinklers=0,\n                _xlfn.XLOOKUP(K$142, 'Grenswaarden landbouw'!$B$36:$B$46, 'Grenswaarden landbouw'!$E$36:$E$46),\n                _xlfn.XLOOKUP(K$142, 'Grenswaarden landbouw'!$B$50:$B$60, 'Grenswaarden landbouw'!$E$50:$E$60)\n            )\n        )\n    ),\n\"\"))","v":"-"},{"$f":"IF(L153=\"-\",\"-\",IF(L$142<>\"\",\n    IF(OR(L153=\"n.v.t.\",L153=\"...\"), \"n.v.t.\",\n        IF(L153=\"Ja\", \"hoog\",\n            IF(sprinklers=0,\n                _xlfn.XLOOKUP(L$142, 'Grenswaarden landbouw'!$B$36:$B$46, 'Grenswaarden landbouw'!$E$36:$E$46),\n                _xlfn.XLOOKUP(L$142, 'Grenswaarden landbouw'!$B$50:$B$60, 'Grenswaarden landbouw'!$E$50:$E$60)\n            )\n        )\n    ),\n\"\"))","v":"-"},{"$f":"IF(M153=\"-\",\"-\",IF(M$142<>\"\",\n    IF(OR(M153=\"n.v.t.\",M153=\"...\"), \"n.v.t.\",\n        IF(M153=\"Ja\", \"hoog\",\n            IF(sprinklers=0,\n                _xlfn.XLOOKUP(M$142, 'Grenswaarden landbouw'!$B$36:$B$46, 'Grenswaarden landbouw'!$E$36:$E$46),\n                _xlfn.XLOOKUP(M$142, 'Grenswaarden landbouw'!$B$50:$B$60, 'Grenswaarden landbouw'!$E$50:$E$60)\n            )\n        )\n    ),\n\"\"))","v":"-"},{"$f":"IF(N153=\"-\",\"-\",IF(N$142<>\"\",\n    IF(OR(N153=\"n.v.t.\",N153=\"...\"), \"n.v.t.\",\n        IF(N153=\"Ja\", \"hoog\",\n            IF(sprinklers=0,\n                _xlfn.XLOOKUP(N$142, 'Grenswaarden landbouw'!$B$36:$B$46, 'Grenswaarden landbouw'!$E$36:$E$46),\n                _xlfn.XLOOKUP(N$142, 'Grenswaarden landbouw'!$B$50:$B$60, 'Grenswaarden landbouw'!$E$50:$E$60)\n            )\n        )\n    ),\n\"\"))","v":"-"},null,null,null,null,0]
[null,null,"Tijdens de vegetatieve groei",{"$f":"IF(D154=\"-\",\"-\",IF(D$142<>\"\",\n    IF(OR(D154=\"n.v.t.\",D154=\"...\"), \"n.v.t.\",\n        IF(D154=\"Ja\", \"hoog\",\n            IF(sprinklers=0,\n                _xlfn.XLOOKUP(D$142, 'Grenswaarden landbouw'!$B$36:$B$46, 'Grenswaarden landbouw'!$F$36:$F$46),\n                _xlfn.XLOOKUP(D$142, 'Grenswaarden landbouw'!$B$50:$B$60, 'Grenswaarden landbouw'!$F$50:$F$60)\n            )\n        )\n    ),\n\"\"))","v":"-"},{"$f":"IF(E154=\"-\",\"-\",IF(E$142<>\"\",\n    IF(OR(E154=\"n.v.t.\",E154=\"...\"), \"n.v.t.\",\n        IF(E154=\"Ja\", \"hoog\",\n            IF(sprinklers=0,\n                _xlfn.XLOOKUP(E$142, 'Grenswaarden landbouw'!$B$36:$B$46, 'Grenswaarden landbouw'!$F$36:$F$46),\n                _xlfn.XLOOKUP(E$142, 'Grenswaarden landbouw'!$B$50:$B$60, 'Grenswaarden landbouw'!$F$50:$F$60)\n            )\n        )\n    ),\n\"\"))","v":"-"},{"$f":"IF(F154=\"-\",\"-\",IF(F$142<>\"\",\n    IF(OR(F154=\"n.v.t.\",F154=\"...\"), \"n.v.t.\",\n        IF(F154=\"Ja\", \"hoog\",\n            IF(sprinklers=0,\n                _xlfn.XLOOKUP(F$142, 'Grenswaarden landbouw'!$B$36:$B$46, 'Grenswaarden landbouw'!$F$36:$F$46),\n                _xlfn.XLOOKUP(F$142, 'Grenswaarden landbouw'!$B$50:$B$60, 'Grenswaarden landbouw'!$F$50:$F$60)\n            )\n        )\n    ),\n\"\"))","v":"-"},{"$f":"IF(G154=\"-\",\"-\",IF(G$142<>\"\",\n    IF(OR(G154=\"n.v.t.\",G154=\"...\"), \"n.v.t.\",\n        IF(G154=\"Ja\", \"hoog\",\n            IF(sprinklers=0,\n                _xlfn.XLOOKUP(G$142, 'Grenswaarden landbouw'!$B$36:$B$46, 'Grenswaarden landbouw'!$F$36:$F$46),\n                _xlfn.XLOOKUP(G$142, 'Grenswaarden landbouw'!$B$50:$B$60, 'Grenswaarden landbouw'!$F$50:$F$60)\n            )\n        )\n    ),\n\"\"))","v":"-"},{"$f":"IF(H154=\"-\",\"-\",IF(H$142<>\"\",\n    IF(OR(H154=\"n.v.t.\",H154=\"...\"), \"n.v.t.\",\n        IF(H154=\"Ja\", \"hoog\",\n            IF(sprinklers=0,\n                _xlfn.XLOOKUP(H$142, 'Grenswaarden landbouw'!$B$36:$B$46, 'Grenswaarden landbouw'!$F$36:$F$46),\n                _xlfn.XLOOKUP(H$142, 'Grenswaarden landbouw'!$B$50:$B$60, 'Grenswaarden landbouw'!$F$50:$F$60)\n            )\n        )\n    ),\n\"\"))","v":"-"},{"$f":"IF(I154=\"-\",\"-\",IF(I$142<>\"\",\n    IF(OR(I154=\"n.v.t.\",I154=\"...\"), \"n.v.t.\",\n        IF(I154=\"Ja\", \"hoog\",\n            IF(sprinklers=0,\n                _xlfn.XLOOKUP(I$142, 'Grenswaarden landbouw'!$B$36:$B$46, 'Grenswaarden landbouw'!$F$36:$F$46),\n                _xlfn.XLOOKUP(I$142, 'Grenswaarden landbouw'!$B$50:$B$60, 'Grenswaarden landbouw'!$F$50:$F$60)\n            )\n        )\n    ),\n\"\"))","v":"-"},{"$f":"IF(J154=\"-\",\"-\",IF(J$142<>\"\",\n    IF(OR(J154=\"n.v.t.\",J154=\"...\"), \"n.v.t.\",\n        IF(J154=\"Ja\", \"hoog\",\n            IF(sprinklers=0,\n                _xlfn.XLOOKUP(J$142, 'Grenswaarden landbouw'!$B$36:$B$46, 'Grenswaarden landbouw'!$F$36:$F$46),\n                _xlfn.XLOOKUP(J$142, 'Grenswaarden landbouw'!$B$50:$B$60, 'Grenswaarden landbouw'!$F$50:$F$60)\n            )\n        )\n    ),\n\"\"))","v":"-"},{"$f":"IF(K154=\"-\",\"-\",IF(K$142<>\"\",\n    IF(OR(K154=\"n.v.t.\",K154=\"...\"), \"n.v.t.\",\n        IF(K154=\"Ja\", \"hoog\",\n            IF(sprinklers=0,\n                _xlfn.XLOOKUP(K$142, 'Grenswaarden landbouw'!$B$36:$B$46, 'Grenswaarden landbouw'!$F$36:$F$46),\n                _xlfn.XLOOKUP(K$142, 'Grenswaarden landbouw'!$B$50:$B$60, 'Grenswaarden landbouw'!$F$50:$F$60)\n            )\n        )\n    ),\n\"\"))","v":"-"},{"$f":"IF(L154=\"-\",\"-\",IF(L$142<>\"\",\n    IF(OR(L154=\"n.v.t.\",L154=\"...\"), \"n.v.t.\",\n        IF(L154=\"Ja\", \"hoog\",\n            IF(sprinklers=0,\n                _xlfn.XLOOKUP(L$142, 'Grenswaarden landbouw'!$B$36:$B$46, 'Grenswaarden landbouw'!$F$36:$F$46),\n                _xlfn.XLOOKUP(L$142, 'Grenswaarden landbouw'!$B$50:$B$60, 'Grenswaarden landbouw'!$F$50:$F$60)\n            )\n        )\n    ),\n\"\"))","v":"-"},{"$f":"IF(M154=\"-\",\"-\",IF(M$142<>\"\",\n    IF(OR(M154=\"n.v.t.\",M154=\"...\"), \"n.v.t.\",\n        IF(M154=\"Ja\", \"hoog\",\n            IF(sprinklers=0,\n                _xlfn.XLOOKUP(M$142, 'Grenswaarden landbouw'!$B$36:$B$46, 'Grenswaarden landbouw'!$F$36:$F$46),\n                _xlfn.XLOOKUP(M$142, 'Grenswaarden landbouw'!$B$50:$B$60, 'Grenswaarden landbouw'!$F$50:$F$60)\n            )\n        )\n    ),\n\"\"))","v":"-"},{"$f":"IF(N154=\"-\",\"-\",IF(N$142<>\"\",\n    IF(OR(N154=\"n.v.t.\",N154=\"...\"), \"n.v.t.\",\n        IF(N154=\"Ja\", \"hoog\",\n            IF(sprinklers=0,\n                _xlfn.XLOOKUP(N$142, 'Grenswaarden landbouw'!$B$36:$B$46, 'Grenswaarden landbouw'!$F$36:$F$46),\n                _xlfn.XLOOKUP(N$142, 'Grenswaarden landbouw'!$B$50:$B$60, 'Grenswaarden landbouw'!$F$50:$F$60)\n            )\n        )\n    ),\n\"\"))","v":"-"},null,null,null,null,0]
[null,null,"Tijdens de oogst",{"$f":"IF(D155=\"-\",\"-\",IF(D$142<>\"\",\n    IF(OR(D155=\"n.v.t.\",D155=\"...\"), \"n.v.t.\",\n        IF(D155=\"Ja\", \"hoog\",\n            IF(sprinklers=0,\n                _xlfn.XLOOKUP(D$142, 'Grenswaarden landbouw'!$B$36:$B$46, 'Grenswaarden landbouw'!$G$36:$G$46),\n                _xlfn.XLOOKUP(D$142, 'Grenswaarden landbouw'!$B$50:$B$60, 'Grenswaarden landbouw'!$G$50:$G$60)\n            )\n        )\n    ),\n\"\"))","v":"-"},{"$f":"IF(E155=\"-\",\"-\",IF(E$142<>\"\",\n    IF(OR(E155=\"n.v.t.\",E155=\"...\"), \"n.v.t.\",\n        IF(E155=\"Ja\", \"hoog\",\n            IF(sprinklers=0,\n                _xlfn.XLOOKUP(E$142, 'Grenswaarden landbouw'!$B$36:$B$46, 'Grenswaarden landbouw'!$G$36:$G$46),\n                _xlfn.XLOOKUP(E$142, 'Grenswaarden landbouw'!$B$50:$B$60, 'Grenswaarden landbouw'!$G$50:$G$60)\n            )\n        )\n    ),\n\"\"))","v":"-"},{"$f":"IF(F155=\"-\",\"-\",IF(F$142<>\"\",\n    IF(OR(F155=\"n.v.t.\",F155=\"...\"), \"n.v.t.\",\n        IF(F155=\"Ja\", \"hoog\",\n            IF(sprinklers=0,\n                _xlfn.XLOOKUP(F$142, 'Grenswaarden landbouw'!$B$36:$B$46, 'Grenswaarden landbouw'!$G$36:$G$46),\n                _xlfn.XLOOKUP(F$142, 'Grenswaarden landbouw'!$B$50:$B$60, 'Grenswaarden landbouw'!$G$50:$G$60)\n            )\n        )\n    ),\n\"\"))","v":"-"},{"$f":"IF(G155=\"-\",\"-\",IF(G$142<>\"\",\n    IF(OR(G155=\"n.v.t.\",G155=\"...\"), \"n.v.t.\",\n        IF(G155=\"Ja\", \"hoog\",\n            IF(sprinklers=0,\n                _xlfn.XLOOKUP(G$142, 'Grenswaarden landbouw'!$B$36:$B$46, 'Grenswaarden landbouw'!$G$36:$G$46),\n                _xlfn.XLOOKUP(G$142, 'Grenswaarden landbouw'!$B$50:$B$60, 'Grenswaarden landbouw'!$G$50:$G$60)\n            )\n        )\n    ),\n\"\"))","v":"-"},{"$f":"IF(H155=\"-\",\"-\",IF(H$142<>\"\",\n    IF(OR(H155=\"n.v.t.\",H155=\"...\"), \"n.v.t.\",\n        IF(H155=\"Ja\", \"hoog\",\n            IF(sprinklers=0,\n                _xlfn.XLOOKUP(H$142, 'Grenswaarden landbouw'!$B$36:$B$46, 'Grenswaarden landbouw'!$G$36:$G$46),\n                _xlfn.XLOOKUP(H$142, 'Grenswaarden landbouw'!$B$50:$B$60, 'Grenswaarden landbouw'!$G$50:$G$60)\n            )\n        )\n    ),\n\"\"))","v":"-"},{"$f":"IF(I155=\"-\",\"-\",IF(I$142<>\"\",\n    IF(OR(I155=\"n.v.t.\",I155=\"...\"), \"n.v.t.\",\n        IF(I155=\"Ja\", \"hoog\",\n            IF(sprinklers=0,\n                _xlfn.XLOOKUP(I$142, 'Grenswaarden landbouw'!$B$36:$B$46, 'Grenswaarden landbouw'!$G$36:$G$46),\n                _xlfn.XLOOKUP(I$142, 'Grenswaarden landbouw'!$B$50:$B$60, 'Grenswaarden landbouw'!$G$50:$G$60)\n            )\n        )\n    ),\n\"\"))","v":"-"},{"$f":"IF(J155=\"-\",\"-\",IF(J$142<>\"\",\n    IF(OR(J155=\"n.v.t.\",J155=\"...\"), \"n.v.t.\",\n        IF(J155=\"Ja\", \"hoog\",\n            IF(sprinklers=0,\n                _xlfn.XLOOKUP(J$142, 'Grenswaarden landbouw'!$B$36:$B$46, 'Grenswaarden landbouw'!$G$36:$G$46),\n                _xlfn.XLOOKUP(J$142, 'Grenswaarden landbouw'!$B$50:$B$60, 'Grenswaarden landbouw'!$G$50:$G$60)\n            )\n        )\n    ),\n\"\"))","v":"-"},{"$f":"IF(K155=\"-\",\"-\",IF(K$142<>\"\",\n    IF(OR(K155=\"n.v.t.\",K155=\"...\"), \"n.v.t.\",\n        IF(K155=\"Ja\", \"hoog\",\n            IF(sprinklers=0,\n                _xlfn.XLOOKUP(K$142, 'Grenswaarden landbouw'!$B$36:$B$46, 'Grenswaarden landbouw'!$G$36:$G$46),\n                _xlfn.XLOOKUP(K$142, 'Grenswaarden landbouw'!$B$50:$B$60, 'Grenswaarden landbouw'!$G$50:$G$60)\n            )\n        )\n    ),\n\"\"))","v":"-"},{"$f":"IF(L155=\"-\",\"-\",IF(L$142<>\"\",\n    IF(OR(L155=\"n.v.t.\",L155=\"...\"), \"n.v.t.\",\n        IF(L155=\"Ja\", \"hoog\",\n            IF(sprinklers=0,\n                _xlfn.XLOOKUP(L$142, 'Grenswaarden landbouw'!$B$36:$B$46, 'Grenswaarden landbouw'!$G$36:$G$46),\n                _xlfn.XLOOKUP(L$142, 'Grenswaarden landbouw'!$B$50:$B$60, 'Grenswaarden landbouw'!$G$50:$G$60)\n            )\n        )\n    ),\n\"\"))","v":"-"},{"$f":"IF(M155=\"-\",\"-\",IF(M$142<>\"\",\n    IF(OR(M155=\"n.v.t.\",M155=\"...\"), \"n.v.t.\",\n        IF(M155=\"Ja\", \"hoog\",\n            IF(sprinklers=0,\n                _xlfn.XLOOKUP(M$142, 'Grenswaarden landbouw'!$B$36:$B$46, 'Grenswaarden landbouw'!$G$36:$G$46),\n                _xlfn.XLOOKUP(M$142, 'Grenswaarden landbouw'!$B$50:$B$60, 'Grenswaarden landbouw'!$G$50:$G$60)\n            )\n        )\n    ),\n\"\"))","v":"-"},{"$f":"IF(N155=\"-\",\"-\",IF(N$142<>\"\",\n    IF(OR(N155=\"n.v.t.\",N155=\"...\"), \"n.v.t.\",\n        IF(N155=\"Ja\", \"hoog\",\n            IF(sprinklers=0,\n                _xlfn.XLOOKUP(N$142, 'Grenswaarden landbouw'!$B$36:$B$46, 'Grenswaarden landbouw'!$G$36:$G$46),\n                _xlfn.XLOOKUP(N$142, 'Grenswaarden landbouw'!$B$50:$B$60, 'Grenswaarden landbouw'!$G$50:$G$60)\n            )\n        )\n    ),\n\"\"))","v":"-"},null,null,null,null,0]
[null,null,null,null,null,null,null,null,null,null,null,null,null,null,null,null,null,null,0]
[null,null,"Risico totaal",{"$f":"IF(D41<>\"\",IF(D83=\"hoog\", \"hoog\",IF(COUNTIF(D159:D163, \"hoog\") > 0, \"hoog\", IF(COUNTIF(D159:D163, \"midden\") > 0, \"midden\", IF(COUNTIF(D159:D163, \"laag\") > 0,\"laag\",\"-\")))),\"\")","v":"-"},{"$f":"IF(E41<>\"\",IF(E83=\"hoog\", \"hoog\",IF(COUNTIF(E159:E163, \"hoog\") > 0, \"hoog\", IF(COUNTIF(E159:E163, \"midden\") > 0, \"midden\", IF(COUNTIF(E159:E163, \"laag\") > 0,\"laag\",\"-\")))),\"\")","v":""},"","","","","","","","","",null,null,null,null,0]
[null,null,"De hoogste risico waarde bepaalt het risico totaal. Het is aan de gebruiker om in te schatten of dit risico niveau van toepassing is op hun projectgebied. Ter illustratie: een doelgewas kan een hoog/hoger risico hebben tijdens de kiemfase, maar deze fase treedt in het jaar bijvoorbeeld met name op wanneer de kans op verzilting heel klein is. Hierdoor kan het eindrisico (o.b.v. een deskundigenoordeel) lager uitvallen.",null,null,null,null,null,null,null,null,null,null,null,null,null,null,null,0]
[null,null,null,null,null,null,null,null,null,null,null,null,null,null,null,null,null,null,0]
[null,null,null,null,null,null,null,null,null,null,null,null,null,null,null,null,null,null,0]
[null,null,null,null,null,null,null,null,null,null,null,null,null,null,null,null,null,null,0]
[null,null,"Bandbreedte \"conservatief\"",null,null,null,null,null,null,null,null,null,null,null,null,null,null,null,0]
[null,null,"Als het watervolume en de bodemstructuur een midden of hoog risico hebben, beschouw dan de risico's binnen de bandbreedte \"conservatief\". Dit is effectief met een kleiïgere bodemstructuur dan die u heeft ingevuld.",null,null,null,null,null,null,null,null,null,null,null,null,null,null,null,0]
[null,null,"Is het bodemtype dat u heeft ingevuld \"Klei\", dan is er geen verschil tussen de \"normale\" en \"conservatieve\" risicobepaling. Een kleibodem is namelijk al het meest gevoelig voor de effecten van zout.",null,null,null,null,null,null,null,null,null,null,null,null,null,null,null,0]
[null,null,null,null,null,null,null,null,null,null,null,null,null,null,null,null,null,null,0]
[null,null,"Overschrijding grenswaarde zoutgehalte",null,null,null,null,null,null,null,null,null,null,null,null,null,null,null,0]
[null,null,"Hier wordt getest of het zoutgehalte van het irrigatiewater t.g.v. een verstoring aanleiding geeft voor een risico t.a.v. effecten door verzilting. Hiervoor wordt de maximale waarde van het zoutgehalte gebruikt.",null,null,null,null,null,null,null,null,null,null,null,null,null,null,null,0]
[null,null,"Algemeen voor het doelgewas",{"$f":"IF(D$142<>\"\",IF(OR($G$137=0,$G$137=\"niet opgegeven\"),\"-\",IF(D62=\"\",\"-\",IF($G$137>D62,\"Ja\",IF(D62=\"n.v.t.\",\"n.v.t.\",\"Nee\")))),\"\")","v":"-"},{"$f":"IF(E$142<>\"\",IF(OR($G$137=0,$G$137=\"niet opgegeven\"),\"-\",IF(E62=\"\",\"-\",IF($G$137>E62,\"Ja\",IF(E62=\"n.v.t.\",\"n.v.t.\",\"Nee\")))),\"\")","v":""},"","","","","","","","","",null,null,null,null,0]
[null,null,"Tijdens de kiemfase",{"$f":"IF(D$142<>\"\",IF(OR($G$137=0,$G$137=\"niet opgegeven\"),\"-\",IF(D63=\"\",\"-\",IF($G$137>D63,\"Ja\",IF(D63=\"n.v.t.\",\"n.v.t.\",\"Nee\")))),\"\")","v":"-"},"","","","","","","","","","",null,null,null,null,0]
[null,null,"Tijdens de zaailingfase","-","","","","","","","","","","",null,null,null,null,0]
[null,null,"Tijdens de vegetatieve groei","-","","","","","","","","","","",null,null,null,null,0]
[null,null,"Tijdens de oogst","-","","","","","","","","","","",null,null,null,null,0]
[null,null,null,null,null,null,null,null,null,null,null,null,null,null,null,null,null,null,0]
[null,null,"Risico zoutgehalte",null,null,null,null,null,null,null,null,null,null,null,null,null,null,null,0]
[null,null,"Beoordeling o.b.v. zouttolerantie (gevoelig = hoog, matig tolerant = midden, tolerant = laag). Overschrijding van de zouttolerantie en een hoog risico op waardevermindering leiden per definitie tot een hoog risico. Irrigatie op het blad verhoogt het risico met 1 niveau.",null,null,null,null,null,null,null,null,null,null,null,null,null,null,null,0]
[null,null,"Algemeen voor het doelgewas",{"$f":"IF(D176=\"-\",\"-\",IF(D$142<>\"\",\n    IF(OR(D176=\"n.v.t.\",D176=\"...\"), \"n.v.t.\",\n        IF(D176=\"Ja\", \"hoog\",\n            IF(sprinklers=0,\n                _xlfn.XLOOKUP(D$142, 'Grenswaarden landbouw'!$B$36:$B$46, 'Grenswaarden landbouw'!$C$36:$C$46),\n                _xlfn.XLOOKUP(D$142, 'Grenswaarden landbouw'!$B$50:$B$60, 'Grenswaarden landbouw'!$C$50:$C$60)\n            )\n        )\n    ),\n\"\"))","v":"-"},{"$f":"IF(E176=\"-\",\"-\",IF(E$142<>\"\",\n    IF(OR(E176=\"n.v.t.\",E176=\"...\"), \"n.v.t.\",\n        IF(E176=\"Ja\", \"hoog\",\n            IF(sprinklers=0,\n                _xlfn.XLOOKUP(E$142, 'Grenswaarden landbouw'!$B$36:$B$46, 'Grenswaarden landbouw'!$C$36:$C$46),\n                _xlfn.XLOOKUP(E$142, 'Grenswaarden landbouw'!$B$50:$B$60, 'Grenswaarden landbouw'!$C$50:$C$60)\n            )\n        )\n    ),\n\"\"))","v":""},{"$f":"IF(F176=\"-\",\"-\",IF(F$142<>\"\",\n    IF(OR(F176=\"n.v.t.\",F176=\"...\"), \"n.v.t.\",\n        IF(F176=\"Ja\", \"hoog\",\n            IF(sprinklers=0,\n                _xlfn.XLOOKUP(F$142, 'Grenswaarden landbouw'!$B$36:$B$46, 'Grenswaarden landbouw'!$C$36:$C$46),\n                _xlfn.XLOOKUP(F$142, 'Grenswaarden landbouw'!$B$50:$B$60, 'Grenswaarden landbouw'!$C$50:$C$60)\n            )\n        )\n    ),\n\"\"))","v":""},{"$f":"IF(G176=\"-\",\"-\",IF(G$142<>\"\",\n    IF(OR(G176=\"n.v.t.\",G176=\"...\"), \"n.v.t.\",\n        IF(G176=\"Ja\", \"hoog\",\n            IF(sprinklers=0,\n                _xlfn.XLOOKUP(G$142, 'Grenswaarden landbouw'!$B$36:$B$46, 'Grenswaarden landbouw'!$C$36:$C$46),\n                _xlfn.XLOOKUP(G$142, 'Grenswaarden landbouw'!$B$50:$B$60, 'Grenswaarden landbouw'!$C$50:$C$60)\n            )\n        )\n    ),\n\"\"))","v":""},{"$f":"IF(H176=\"-\",\"-\",IF(H$142<>\"\",\n    IF(OR(H176=\"n.v.t.\",H176=\"...\"), \"n.v.t.\",\n        IF(H176=\"Ja\", \"hoog\",\n            IF(sprinklers=0,\n                _xlfn.XLOOKUP(H$142, 'Grenswaarden landbouw'!$B$36:$B$46, 'Grenswaarden landbouw'!$C$36:$C$46),\n                _xlfn.XLOOKUP(H$142, 'Grenswaarden landbouw'!$B$50:$B$60, 'Grenswaarden landbouw'!$C$50:$C$60)\n            )\n        )\n    ),\n\"\"))","v":""},{"$f":"IF(I176=\"-\",\"-\",IF(I$142<>\"\",\n    IF(OR(I176=\"n.v.t.\",I176=\"...\"), \"n.v.t.\",\n        IF(I176=\"Ja\", \"hoog\",\n            IF(sprinklers=0,\n                _xlfn.XLOOKUP(I$142, 'Grenswaarden landbouw'!$B$36:$B$46, 'Grenswaarden landbouw'!$C$36:$C$46),\n                _xlfn.XLOOKUP(I$142, 'Grenswaarden landbouw'!$B$50:$B$60, 'Grenswaarden landbouw'!$C$50:$C$60)\n            )\n        )\n    ),\n\"\"))","v":""},{"$f":"IF(J176=\"-\",\"-\",IF(J$142<>\"\",\n    IF(OR(J176=\"n.v.t.\",J176=\"...\"), \"n.v.t.\",\n        IF(J176=\"Ja\", \"hoog\",\n            IF(sprinklers=0,\n                _xlfn.XLOOKUP(J$142, 'Grenswaarden landbouw'!$B$36:$B$46, 'Grenswaarden landbouw'!$C$36:$C$46),\n                _xlfn.XLOOKUP(J$142, 'Grenswaarden landbouw'!$B$50:$B$60, 'Grenswaarden landbouw'!$C$50:$C$60)\n            )\n        )\n    ),\n\"\"))","v":""},{"$f":"IF(K176=\"-\",\"-\",IF(K$142<>\"\",\n    IF(OR(K176=\"n.v.t.\",K176=\"...\"), \"n.v.t.\",\n        IF(K176=\"Ja\", \"hoog\",\n            IF(sprinklers=0,\n                _xlfn.XLOOKUP(K$142, 'Grenswaarden landbouw'!$B$36:$B$46, 'Grenswaarden landbouw'!$C$36:$C$46),\n                _xlfn.XLOOKUP(K$142, 'Grenswaarden landbouw'!$B$50:$B$60, 'Grenswaarden landbouw'!$C$50:$C$60)\n            )\n        )\n    ),\n\"\"))","v":""},{"$f":"IF(L176=\"-\",\"-\",IF(L$142<>\"\",\n    IF(OR(L176=\"n.v.t.\",L176=\"...\"), \"n.v.t.\",\n        IF(L176=\"Ja\", \"hoog\",\n            IF(sprinklers=0,\n                _xlfn.XLOOKUP(L$142, 'Grenswaarden landbouw'!$B$36:$B$46, 'Grenswaarden landbouw'!$C$36:$C$46),\n                _xlfn.XLOOKUP(L$142, 'Grenswaarden landbouw'!$B$50:$B$60, 'Grenswaarden landbouw'!$C$50:$C$60)\n            )\n        )\n    ),\n\"\"))","v":""},{"$f":"IF(M176=\"-\",\"-\",IF(M$142<>\"\",\n    IF(OR(M176=\"n.v.t.\",M176=\"...\"), \"n.v.t.\",\n        IF(M176=\"Ja\", \"hoog\",\n            IF(sprinklers=0,\n                _xlfn.XLOOKUP(M$142, 'Grenswaarden landbouw'!$B$36:$B$46, 'Grenswaarden landbouw'!$C$36:$C$46),\n                _xlfn.XLOOKUP(M$142, 'Grenswaarden landbouw'!$B$50:$B$60, 'Grenswaarden landbouw'!$C$50:$C$60)\n            )\n        )\n    ),\n\"\"))","v":""},{"$f":"IF(N176=\"-\",\"-\",IF(N$142<>\"\",\n    IF(OR(N176=\"n.v.t.\",N176=\"...\"), \"n.v.t.\",\n        IF(N176=\"Ja\", \"hoog\",\n            IF(sprinklers=0,\n                _xlfn.XLOOKUP(N$142, 'Grenswaarden landbouw'!$B$36:$B$46, 'Grenswaarden landbouw'!$C$36:$C$46),\n                _xlfn.XLOOKUP(N$142, 'Grenswaarden landbouw'!$B$50:$B$60, 'Grenswaarden landbouw'!$C$50:$C$60)\n            )\n        )\n    ),\n\"\"))","v":""},null,null,null,null,0]
[null,null,"Tijdens de kiemfase",{"$f":"IF(D177=\"-\",\"-\",IF(D$142<>\"\",\nIF(OR(D177=\"n.v.t.\",D177=\"...\"),\"n.v.t.\",\nIF(D177=\"Ja\",\"hoog\",\nIF(sprinklers=0,\n_xlfn.XLOOKUP(D$142,'Grenswaarden landbouw'!$B$36:$B$46,'Grenswaarden landbouw'!$D$36:$D$46),\n_xlfn.XLOOKUP(D$142,'Grenswaarden landbouw'!$B$50:$B$60,'Grenswaarden landbouw'!$D$50:$D$60)\n)\n)\n),\n\"\"))","v":"-"},{"$f":"IF(E177=\"-\",\"-\",IF(E$142<>\"\",\nIF(OR(E177=\"n.v.t.\",E177=\"...\"),\"n.v.t.\",\nIF(E177=\"Ja\",\"hoog\",\nIF(sprinklers=0,\n_xlfn.XLOOKUP(E$142,'Grenswaarden landbouw'!$B$36:$B$46,'Grenswaarden landbouw'!$D$36:$D$46),\n_xlfn.XLOOKUP(E$142,'Grenswaarden landbouw'!$B$50:$B$60,'Grenswaarden landbouw'!$D$50:$D$60)\n)\n)\n),\n\"\"))","v":""},{"$f":"IF(F177=\"-\",\"-\",IF(F$142<>\"\",\nIF(OR(F177=\"n.v.t.\",F177=\"...\"),\"n.v.t.\",\nIF(F177=\"Ja\",\"hoog\",\nIF(sprinklers=0,\n_xlfn.XLOOKUP(F$142,'Grenswaarden landbouw'!$B$36:$B$46,'Grenswaarden landbouw'!$D$36:$D$46),\n_xlfn.XLOOKUP(F$142,'Grenswaarden landbouw'!$B$50:$B$60,'Grenswaarden landbouw'!$D$50:$D$60)\n)\n)\n),\n\"\"))","v":""},{"$f":"IF(G177=\"-\",\"-\",IF(G$142<>\"\",\nIF(OR(G177=\"n.v.t.\",G177=\"...\"),\"n.v.t.\",\nIF(G177=\"Ja\",\"hoog\",\nIF(sprinklers=0,\n_xlfn.XLOOKUP(G$142,'Grenswaarden landbouw'!$B$36:$B$46,'Grenswaarden landbouw'!$D$36:$D$46),\n_xlfn.XLOOKUP(G$142,'Grenswaarden landbouw'!$B$50:$B$60,'Grenswaarden landbouw'!$D$50:$D$60)\n)\n)\n),\n\"\"))","v":""},{"$f":"IF(H177=\"-\",\"-\",IF(H$142<>\"\",\nIF(OR(H177=\"n.v.t.\",H177=\"...\"),\"n.v.t.\",\nIF(H177=\"Ja\",\"hoog\",\nIF(sprinklers=0,\n_xlfn.XLOOKUP(H$142,'Grenswaarden landbouw'!$B$36:$B$46,'Grenswaarden landbouw'!$D$36:$D$46),\n_xlfn.XLOOKUP(H$142,'Grenswaarden landbouw'!$B$50:$B$60,'Grenswaarden landbouw'!$D$50:$D$60)\n)\n)\n),\n\"\"))","v":""},{"$f":"IF(I177=\"-\",\"-\",IF(I$142<>\"\",\nIF(OR(I177=\"n.v.t.\",I177=\"...\"),\"n.v.t.\",\nIF(I177=\"Ja\",\"hoog\",\nIF(sprinklers=0,\n_xlfn.XLOOKUP(I$142,'Grenswaarden landbouw'!$B$36:$B$46,'Grenswaarden landbouw'!$D$36:$D$46),\n_xlfn.XLOOKUP(I$142,'Grenswaarden landbouw'!$B$50:$B$60,'Grenswaarden landbouw'!$D$50:$D$60)\n)\n)\n),\n\"\"))","v":""},{"$f":"IF(J177=\"-\",\"-\",IF(J$142<>\"\",\nIF(OR(J177=\"n.v.t.\",J177=\"...\"),\"n.v.t.\",\nIF(J177=\"Ja\",\"hoog\",\nIF(sprinklers=0,\n_xlfn.XLOOKUP(J$142,'Grenswaarden landbouw'!$B$36:$B$46,'Grenswaarden landbouw'!$D$36:$D$46),\n_xlfn.XLOOKUP(J$142,'Grenswaarden landbouw'!$B$50:$B$60,'Grenswaarden landbouw'!$D$50:$D$60)\n)\n)\n),\n\"\"))","v":""},{"$f":"IF(K177=\"-\",\"-\",IF(K$142<>\"\",\nIF(OR(K177=\"n.v.t.\",K177=\"...\"),\"n.v.t.\",\nIF(K177=\"Ja\",\"hoog\",\nIF(sprinklers=0,\n_xlfn.XLOOKUP(K$142,'Grenswaarden landbouw'!$B$36:$B$46,'Grenswaarden landbouw'!$D$36:$D$46),\n_xlfn.XLOOKUP(K$142,'Grenswaarden landbouw'!$B$50:$B$60,'Grenswaarden landbouw'!$D$50:$D$60)\n)\n)\n),\n\"\"))","v":""},{"$f":"IF(L177=\"-\",\"-\",IF(L$142<>\"\",\nIF(OR(L177=\"n.v.t.\",L177=\"...\"),\"n.v.t.\",\nIF(L177=\"Ja\",\"hoog\",\nIF(sprinklers=0,\n_xlfn.XLOOKUP(L$142,'Grenswaarden landbouw'!$B$36:$B$46,'Grenswaarden landbouw'!$D$36:$D$46),\n_xlfn.XLOOKUP(L$142,'Grenswaarden landbouw'!$B$50:$B$60,'Grenswaarden landbouw'!$D$50:$D$60)\n)\n)\n),\n\"\"))","v":""},{"$f":"IF(M177=\"-\",\"-\",IF(M$142<>\"\",\nIF(OR(M177=\"n.v.t.\",M177=\"...\"),\"n.v.t.\",\nIF(M177=\"Ja\",\"hoog\",\nIF(sprinklers=0,\n_xlfn.XLOOKUP(M$142,'Grenswaarden landbouw'!$B$36:$B$46,'Grenswaarden landbouw'!$D$36:$D$46),\n_xlfn.XLOOKUP(M$142,'Grenswaarden landbouw'!$B$50:$B$60,'Grenswaarden landbouw'!$D$50:$D$60)\n)\n)\n),\n\"\"))","v":""},{"$f":"IF(N177=\"-\",\"-\",IF(N$142<>\"\",\nIF(OR(N177=\"n.v.t.\",N177=\"...\"),\"n.v.t.\",\nIF(N177=\"Ja\",\"hoog\",\nIF(sprinklers=0,\n_xlfn.XLOOKUP(N$142,'Grenswaarden landbouw'!$B$36:$B$46,'Grenswaarden landbouw'!$D$36:$D$46),\n_xlfn.XLOOKUP(N$142,'Grenswaarden landbouw'!$B$50:$B$60,'Grenswaarden landbouw'!$D$50:$D$60)\n)\n)\n),\n\"\"))","v":""},null,null,null,null,0]
[null,null,"Tijdens de zaailingfase",{"$f":"IF(D178=\"-\",\"-\",IF(D$142<>\"\",\nIF(OR(D178=\"n.v.t.\",D178=\"...\"),\"n.v.t.\",\nIF(D178=\"Ja\",\"hoog\",\nIF(sprinklers=0,\n_xlfn.XLOOKUP(D$142,'Grenswaarden landbouw'!$B$36:$B$46,'Grenswaarden landbouw'!$E$36:$E$46),\n_xlfn.XLOOKUP(D$142,'Grenswaarden landbouw'!$B$50:$B$60,'Grenswaarden landbouw'!$E$50:$E$60)\n)\n)\n),\n\"\"))","v":"-"},{"$f":"IF(E178=\"-\",\"-\",IF(E$142<>\"\",\nIF(OR(E178=\"n.v.t.\",E178=\"...\"),\"n.v.t.\",\nIF(E178=\"Ja\",\"hoog\",\nIF(sprinklers=0,\n_xlfn.XLOOKUP(E$142,'Grenswaarden landbouw'!$B$36:$B$46,'Grenswaarden landbouw'!$E$36:$E$46),\n_xlfn.XLOOKUP(E$142,'Grenswaarden landbouw'!$B$50:$B$60,'Grenswaarden landbouw'!$E$50:$E$60)\n)\n)\n),\n\"\"))","v":""},{"$f":"IF(F178=\"-\",\"-\",IF(F$142<>\"\",\nIF(OR(F178=\"n.v.t.\",F178=\"...\"),\"n.v.t.\",\nIF(F178=\"Ja\",\"hoog\",\nIF(sprinklers=0,\n_xlfn.XLOOKUP(F$142,'Grenswaarden landbouw'!$B$36:$B$46,'Grenswaarden landbouw'!$E$36:$E$46),\n_xlfn.XLOOKUP(F$142,'Grenswaarden landbouw'!$B$50:$B$60,'Grenswaarden landbouw'!$E$50:$E$60)\n)\n)\n),\n\"\"))","v":""},{"$f":"IF(G178=\"-\",\"-\",IF(G$142<>\"\",\nIF(OR(G178=\"n.v.t.\",G178=\"...\"),\"n.v.t.\",\nIF(G178=\"Ja\",\"hoog\",\nIF(sprinklers=0,\n_xlfn.XLOOKUP(G$142,'Grenswaarden landbouw'!$B$36:$B$46,'Grenswaarden landbouw'!$E$36:$E$46),\n_xlfn.XLOOKUP(G$142,'Grenswaarden landbouw'!$B$50:$B$60,'Grenswaarden landbouw'!$E$50:$E$60)\n)\n)\n),\n\"\"))","v":""},{"$f":"IF(H178=\"-\",\"-\",IF(H$142<>\"\",\nIF(OR(H178=\"n.v.t.\",H178=\"...\"),\"n.v.t.\",\nIF(H178=\"Ja\",\"hoog\",\nIF(sprinklers=0,\n_xlfn.XLOOKUP(H$142,'Grenswaarden landbouw'!$B$36:$B$46,'Grenswaarden landbouw'!$E$36:$E$46),\n_xlfn.XLOOKUP(H$142,'Grenswaarden landbouw'!$B$50:$B$60,'Grenswaarden landbouw'!$E$50:$E$60)\n)\n)\n),\n\"\"))","v":""},{"$f":"IF(I178=\"-\",\"-\",IF(I$142<>\"\",\nIF(OR(I178=\"n.v.t.\",I178=\"...\"),\"n.v.t.\",\nIF(I178=\"Ja\",\"hoog\",\nIF(sprinklers=0,\n_xlfn.XLOOKUP(I$142,'Grenswaarden landbouw'!$B$36:$B$46,'Grenswaarden landbouw'!$E$36:$E$46),\n_xlfn.XLOOKUP(I$142,'Grenswaarden landbouw'!$B$50:$B$60,'Grenswaarden landbouw'!$E$50:$E$60)\n)\n)\n),\n\"\"))","v":""},{"$f":"IF(J178=\"-\",\"-\",IF(J$142<>\"\",\nIF(OR(J178=\"n.v.t.\",J178=\"...\"),\"n.v.t.\",\nIF(J178=\"Ja\",\"hoog\",\nIF(sprinklers=0,\n_xlfn.XLOOKUP(J$142,'Grenswaarden landbouw'!$B$36:$B$46,'Grenswaarden landbouw'!$E$36:$E$46),\n_xlfn.XLOOKUP(J$142,'Grenswaarden landbouw'!$B$50:$B$60,'Grenswaarden landbouw'!$E$50:$E$60)\n)\n)\n),\n\"\"))","v":""},{"$f":"IF(K178=\"-\",\"-\",IF(K$142<>\"\",\nIF(OR(K178=\"n.v.t.\",K178=\"...\"),\"n.v.t.\",\nIF(K178=\"Ja\",\"hoog\",\nIF(sprinklers=0,\n_xlfn.XLOOKUP(K$142,'Grenswaarden landbouw'!$B$36:$B$46,'Grenswaarden landbouw'!$E$36:$E$46),\n_xlfn.XLOOKUP(K$142,'Grenswaarden landbouw'!$B$50:$B$60,'Grenswaarden landbouw'!$E$50:$E$60)\n)\n)\n),\n\"\"))","v":""},{"$f":"IF(L178=\"-\",\"-\",IF(L$142<>\"\",\nIF(OR(L178=\"n.v.t.\",L178=\"...\"),\"n.v.t.\",\nIF(L178=\"Ja\",\"hoog\",\nIF(sprinklers=0,\n_xlfn.XLOOKUP(L$142,'Grenswaarden landbouw'!$B$36:$B$46,'Grenswaarden landbouw'!$E$36:$E$46),\n_xlfn.XLOOKUP(L$142,'Grenswaarden landbouw'!$B$50:$B$60,'Grenswaarden landbouw'!$E$50:$E$60)\n)\n)\n),\n\"\"))","v":""},{"$f":"IF(M178=\"-\",\"-\",IF(M$142<>\"\",\nIF(OR(M178=\"n.v.t.\",M178=\"...\"),\"n.v.t.\",\nIF(M178=\"Ja\",\"hoog\",\nIF(sprinklers=0,\n_xlfn.XLOOKUP(M$142,'Grenswaarden landbouw'!$B$36:$B$46,'Grenswaarden landbouw'!$E$36:$E$46),\n_xlfn.XLOOKUP(M$142,'Grenswaarden landbouw'!$B$50:$B$60,'Grenswaarden landbouw'!$E$50:$E$60)\n)\n)\n),\n\"\"))","v":""},{"$f":"IF(N178=\"-\",\"-\",IF(N$142<>\"\",\nIF(OR(N178=\"n.v.t.\",N178=\"...\"),\"n.v.t.\",\nIF(N178=\"Ja\",\"hoog\",\nIF(sprinklers=0,\n_xlfn.XLOOKUP(N$142,'Grenswaarden landbouw'!$B$36:$B$46,'Grenswaarden landbouw'!$E$36:$E$46),\n_xlfn.XLOOKUP(N$142,'Grenswaarden landbouw'!$B$50:$B$60,'Grenswaarden landbouw'!$E$50:$E$60)\n)\n)\n),\n\"\"))","v":""},null,null,null,null,0]
[null,null,"Tijdens de vegetatieve groei",{"$f":"IF(D179=\"-\",\"-\",IF(D$142<>\"\",\nIF(OR(D179=\"n.v.t.\",D179=\"...\"),\"n.v.t.\",\nIF(D179=\"Ja\",\"hoog\",\nIF(sprinklers=0,\n_xlfn.XLOOKUP(D$142,'Grenswaarden landbouw'!$B$36:$B$46,'Grenswaarden landbouw'!$F$36:$F$46),\n_xlfn.XLOOKUP(D$142,'Grenswaarden landbouw'!$B$50:$B$60,'Grenswaarden landbouw'!$F$50:$F$60)\n)\n)\n),\n\"\"))","v":"-"},{"$f":"IF(E179=\"-\",\"-\",IF(E$142<>\"\",\nIF(OR(E179=\"n.v.t.\",E179=\"...\"),\"n.v.t.\",\nIF(E179=\"Ja\",\"hoog\",\nIF(sprinklers=0,\n_xlfn.XLOOKUP(E$142,'Grenswaarden landbouw'!$B$36:$B$46,'Grenswaarden landbouw'!$F$36:$F$46),\n_xlfn.XLOOKUP(E$142,'Grenswaarden landbouw'!$B$50:$B$60,'Grenswaarden landbouw'!$F$50:$F$60)\n)\n)\n),\n\"\"))","v":""},{"$f":"IF(F179=\"-\",\"-\",IF(F$142<>\"\",\nIF(OR(F179=\"n.v.t.\",F179=\"...\"),\"n.v.t.\",\nIF(F179=\"Ja\",\"hoog\",\nIF(sprinklers=0,\n_xlfn.XLOOKUP(F$142,'Grenswaarden landbouw'!$B$36:$B$46,'Grenswaarden landbouw'!$F$36:$F$46),\n_xlfn.XLOOKUP(F$142,'Grenswaarden landbouw'!$B$50:$B$60,'Grenswaarden landbouw'!$F$50:$F$60)\n)\n)\n),\n\"\"))","v":""},{"$f":"IF(G179=\"-\",\"-\",IF(G$142<>\"\",\nIF(OR(G179=\"n.v.t.\",G179=\"...\"),\"n.v.t.\",\nIF(G179=\"Ja\",\"hoog\",\nIF(sprinklers=0,\n_xlfn.XLOOKUP(G$142,'Grenswaarden landbouw'!$B$36:$B$46,'Grenswaarden landbouw'!$F$36:$F$46),\n_xlfn.XLOOKUP(G$142,'Grenswaarden landbouw'!$B$50:$B$60,'Grenswaarden landbouw'!$F$50:$F$60)\n)\n)\n),\n\"\"))","v":""},{"$f":"IF(H179=\"-\",\"-\",IF(H$142<>\"\",\nIF(OR(H179=\"n.v.t.\",H179=\"...\"),\"n.v.t.\",\nIF(H179=\"Ja\",\"hoog\",\nIF(sprinklers=0,\n_xlfn.XLOOKUP(H$142,'Grenswaarden landbouw'!$B$36:$B$46,'Grenswaarden landbouw'!$F$36:$F$46),\n_xlfn.XLOOKUP(H$142,'Grenswaarden landbouw'!$B$50:$B$60,'Grenswaarden landbouw'!$F$50:$F$60)\n)\n)\n),\n\"\"))","v":""},{"$f":"IF(I179=\"-\",\"-\",IF(I$142<>\"\",\nIF(OR(I179=\"n.v.t.\",I179=\"...\"),\"n.v.t.\",\nIF(I179=\"Ja\",\"hoog\",\nIF(sprinklers=0,\n_xlfn.XLOOKUP(I$142,'Grenswaarden landbouw'!$B$36:$B$46,'Grenswaarden landbouw'!$F$36:$F$46),\n_xlfn.XLOOKUP(I$142,'Grenswaarden landbouw'!$B$50:$B$60,'Grenswaarden landbouw'!$F$50:$F$60)\n)\n)\n),\n\"\"))","v":""},{"$f":"IF(J179=\"-\",\"-\",IF(J$142<>\"\",\nIF(OR(J179=\"n.v.t.\",J179=\"...\"),\"n.v.t.\",\nIF(J179=\"Ja\",\"hoog\",\nIF(sprinklers=0,\n_xlfn.XLOOKUP(J$142,'Grenswaarden landbouw'!$B$36:$B$46,'Grenswaarden landbouw'!$F$36:$F$46),\n_xlfn.XLOOKUP(J$142,'Grenswaarden landbouw'!$B$50:$B$60,'Grenswaarden landbouw'!$F$50:$F$60)\n)\n)\n),\n\"\"))","v":""},{"$f":"IF(K179=\"-\",\"-\",IF(K$142<>\"\",\nIF(OR(K179=\"n.v.t.\",K179=\"...\"),\"n.v.t.\",\nIF(K179=\"Ja\",\"hoog\",\nIF(sprinklers=0,\n_xlfn.XLOOKUP(K$142,'Grenswaarden landbouw'!$B$36:$B$46,'Grenswaarden landbouw'!$F$36:$F$46),\n_xlfn.XLOOKUP(K$142,'Grenswaarden landbouw'!$B$50:$B$60,'Grenswaarden landbouw'!$F$50:$F$60)\n)\n)\n),\n\"\"))","v":""},{"$f":"IF(L179=\"-\",\"-\",IF(L$142<>\"\",\nIF(OR(L179=\"n.v.t.\",L179=\"...\"),\"n.v.t.\",\nIF(L179=\"Ja\",\"hoog\",\nIF(sprinklers=0,\n_xlfn.XLOOKUP(L$142,'Grenswaarden landbouw'!$B$36:$B$46,'Grenswaarden landbouw'!$F$36:$F$46),\n_xlfn.XLOOKUP(L$142,'Grenswaarden landbouw'!$B$50:$B$60,'Grenswaarden landbouw'!$F$50:$F$60)\n)\n)\n),\n\"\"))","v":""},{"$f":"IF(M179=\"-\",\"-\",IF(M$142<>\"\",\nIF(OR(M179=\"n.v.t.\",M179=\"...\"),\"n.v.t.\",\nIF(M179=\"Ja\",\"hoog\",\nIF(sprinklers=0,\n_xlfn.XLOOKUP(M$142,'Grenswaarden landbouw'!$B$36:$B$46,'Grenswaarden landbouw'!$F$36:$F$46),\n_xlfn.XLOOKUP(M$142,'Grenswaarden landbouw'!$B$50:$B$60,'Grenswaarden landbouw'!$F$50:$F$60)\n)\n)\n),\n\"\"))","v":""},{"$f":"IF(N179=\"-\",\"-\",IF(N$142<>\"\",\nIF(OR(N179=\"n.v.t.\",N179=\"...\"),\"n.v.t.\",\nIF(N179=\"Ja\",\"hoog\",\nIF(sprinklers=0,\n_xlfn.XLOOKUP(N$142,'Grenswaarden landbouw'!$B$36:$B$46,'Grenswaarden landbouw'!$F$36:$F$46),\n_xlfn.XLOOKUP(N$142,'Grenswaarden landbouw'!$B$50:$B$60,'Grenswaarden landbouw'!$F$50:$F$60)\n)\n)\n),\n\"\"))","v":""},null,null,null,null,0]
[null,null,"Tijdens de oogst",{"$f":"IF(D180=\"-\",\"-\",IF(D$142<>\"\",\nIF(OR(D180=\"n.v.t.\",D180=\"...\"),\"n.v.t.\",\nIF(D180=\"Ja\",\"hoog\",\nIF(sprinklers=0,\n_xlfn.XLOOKUP(D$142,'Grenswaarden landbouw'!$B$36:$B$46,'Grenswaarden landbouw'!$G$36:$G$46),\n_xlfn.XLOOKUP(D$142,'Grenswaarden landbouw'!$B$50:$B$60,'Grenswaarden landbouw'!$G$50:$G$60)\n)\n)\n),\n\"\"))","v":"-"},{"$f":"IF(E180=\"-\",\"-\",IF(E$142<>\"\",\nIF(OR(E180=\"n.v.t.\",E180=\"...\"),\"n.v.t.\",\nIF(E180=\"Ja\",\"hoog\",\nIF(sprinklers=0,\n_xlfn.XLOOKUP(E$142,'Grenswaarden landbouw'!$B$36:$B$46,'Grenswaarden landbouw'!$G$36:$G$46),\n_xlfn.XLOOKUP(E$142,'Grenswaarden landbouw'!$B$50:$B$60,'Grenswaarden landbouw'!$G$50:$G$60)\n)\n)\n),\n\"\"))","v":""},{"$f":"IF(F180=\"-\",\"-\",IF(F$142<>\"\",\nIF(OR(F180=\"n.v.t.\",F180=\"...\"),\"n.v.t.\",\nIF(F180=\"Ja\",\"hoog\",\nIF(sprinklers=0,\n_xlfn.XLOOKUP(F$142,'Grenswaarden landbouw'!$B$36:$B$46,'Grenswaarden landbouw'!$G$36:$G$46),\n_xlfn.XLOOKUP(F$142,'Grenswaarden landbouw'!$B$50:$B$60,'Grenswaarden landbouw'!$G$50:$G$60)\n)\n)\n),\n\"\"))","v":""},{"$f":"IF(G180=\"-\",\"-\",IF(G$142<>\"\",\nIF(OR(G180=\"n.v.t.\",G180=\"...\"),\"n.v.t.\",\nIF(G180=\"Ja\",\"hoog\",\nIF(sprinklers=0,\n_xlfn.XLOOKUP(G$142,'Grenswaarden landbouw'!$B$36:$B$46,'Grenswaarden landbouw'!$G$36:$G$46),\n_xlfn.XLOOKUP(G$142,'Grenswaarden landbouw'!$B$50:$B$60,'Grenswaarden landbouw'!$G$50:$G$60)\n)\n)\n),\n\"\"))","v":""},{"$f":"IF(H180=\"-\",\"-\",IF(H$142<>\"\",\nIF(OR(H180=\"n.v.t.\",H180=\"...\"),\"n.v.t.\",\nIF(H180=\"Ja\",\"hoog\",\nIF(sprinklers=0,\n_xlfn.XLOOKUP(H$142,'Grenswaarden landbouw'!$B$36:$B$46,'Grenswaarden landbouw'!$G$36:$G$46),\n_xlfn.XLOOKUP(H$142,'Grenswaarden landbouw'!$B$50:$B$60,'Grenswaarden landbouw'!$G$50:$G$60)\n)\n)\n),\n\"\"))","v":""},{"$f":"IF(I180=\"-\",\"-\",IF(I$142<>\"\",\nIF(OR(I180=\"n.v.t.\",I180=\"...\"),\"n.v.t.\",\nIF(I180=\"Ja\",\"hoog\",\nIF(sprinklers=0,\n_xlfn.XLOOKUP(I$142,'Grenswaarden landbouw'!$B$36:$B$46,'Grenswaarden landbouw'!$G$36:$G$46),\n_xlfn.XLOOKUP(I$142,'Grenswaarden landbouw'!$B$50:$B$60,'Grenswaarden landbouw'!$G$50:$G$60)\n)\n)\n),\n\"\"))","v":""},{"$f":"IF(J180=\"-\",\"-\",IF(J$142<>\"\",\nIF(OR(J180=\"n.v.t.\",J180=\"...\"),\"n.v.t.\",\nIF(J180=\"Ja\",\"hoog\",\nIF(sprinklers=0,\n_xlfn.XLOOKUP(J$142,'Grenswaarden landbouw'!$B$36:$B$46,'Grenswaarden landbouw'!$G$36:$G$46),\n_xlfn.XLOOKUP(J$142,'Grenswaarden landbouw'!$B$50:$B$60,'Grenswaarden landbouw'!$G$50:$G$60)\n)\n)\n),\n\"\"))","v":""},{"$f":"IF(K180=\"-\",\"-\",IF(K$142<>\"\",\nIF(OR(K180=\"n.v.t.\",K180=\"...\"),\"n.v.t.\",\nIF(K180=\"Ja\",\"hoog\",\nIF(sprinklers=0,\n_xlfn.XLOOKUP(K$142,'Grenswaarden landbouw'!$B$36:$B$46,'Grenswaarden landbouw'!$G$36:$G$46),\n_xlfn.XLOOKUP(K$142,'Grenswaarden landbouw'!$B$50:$B$60,'Grenswaarden landbouw'!$G$50:$G$60)\n)\n)\n),\n\"\"))","v":""},{"$f":"IF(L180=\"-\",\"-\",IF(L$142<>\"\",\nIF(OR(L180=\"n.v.t.\",L180=\"...\"),\"n.v.t.\",\nIF(L180=\"Ja\",\"hoog\",\nIF(sprinklers=0,\n_xlfn.XLOOKUP(L$142,'Grenswaarden landbouw'!$B$36:$B$46,'Grenswaarden landbouw'!$G$36:$G$46),\n_xlfn.XLOOKUP(L$142,'Grenswaarden landbouw'!$B$50:$B$60,'Grenswaarden landbouw'!$G$50:$G$60)\n)\n)\n),\n\"\"))","v":""},{"$f":"IF(M180=\"-\",\"-\",IF(M$142<>\"\",\nIF(OR(M180=\"n.v.t.\",M180=\"...\"),\"n.v.t.\",\nIF(M180=\"Ja\",\"hoog\",\nIF(sprinklers=0,\n_xlfn.XLOOKUP(M$142,'Grenswaarden landbouw'!$B$36:$B$46,'Grenswaarden landbouw'!$G$36:$G$46),\n_xlfn.XLOOKUP(M$142,'Grenswaarden landbouw'!$B$50:$B$60,'Grenswaarden landbouw'!$G$50:$G$60)\n)\n)\n),\n\"\"))","v":""},{"$f":"IF(N180=\"-\",\"-\",IF(N$142<>\"\",\nIF(OR(N180=\"n.v.t.\",N180=\"...\"),\"n.v.t.\",\nIF(N180=\"Ja\",\"hoog\",\nIF(sprinklers=0,\n_xlfn.XLOOKUP(N$142,'Grenswaarden landbouw'!$B$36:$B$46,'Grenswaarden landbouw'!$G$36:$G$46),\n_xlfn.XLOOKUP(N$142,'Grenswaarden landbouw'!$B$50:$B$60,'Grenswaarden landbouw'!$G$50:$G$60)\n)\n)\n),\n\"\"))","v":""},null,null,null,null,0]
[null,null,null,null,null,null,null,null,null,null,null,null,null,null,null,null,null,null,0]
[null,null,"Risico totaal",{"$f":"IF(D41<>\"\",IF(D83=\"hoog\", \"hoog\",IF(COUNTIF(D184:D188, \"hoog\") > 0, \"hoog\", IF(COUNTIF(D184:D188, \"midden\") > 0, \"midden\", IF(COUNTIF(D184:D188, \"laag\") > 0,\"laag\",\"-\")))),\"\")","v":"-"},{"$f":"IF(E41<>\"\",IF(E83=\"hoog\", \"hoog\",IF(COUNTIF(E184:E188, \"hoog\") > 0, \"hoog\", IF(COUNTIF(E184:E188, \"midden\") > 0, \"midden\", IF(COUNTIF(E184:E188, \"laag\") > 0,\"laag\",\"-\")))),\"\")","v":""},"","","","","","","","","",null,null,null,null,0]
[null,null,"De hoogste risico waarde bepaalt het risico totaal. Het is aan de gebruiker om in te schatten of dit risico niveau van toepassing is op hun projectgebied. Ter illustratie: een doelgewas kan een hoog/hoger risico hebben tijdens de kiemfase, maar deze fase treedt in het jaar bijvoorbeeld met name op wanneer de kans op verzilting heel klein is. Hierdoor kan het eindrisico (o.b.v. een deskundigenoordeel) lager uitvallen.",null,null,null,null,null,null,null,null,null,null,null,null,null,null,null,0]
[null,null,null,null,null,null,null,null,null,null,null,null,null,null,null,null,null,null,0]
[]
[]
["BLOK 5: \nVEE DRENKING"]
[null,null,"Oordeelsblok 5. vee drenking",null,null,null,null,null,null,null,null,null,null,null,{"$f":"IF(O2<>\"\",IF(O30=\"Ja\",\"hoog\",IF(O9>'2. Landbouw'!$N$50,IF('2. Landbouw'!$K$31=Invoer!$C$14,\"midden\",\"laag\"),\"hoog\")),\"\")","v":""},{"$f":"IF(P2<>\"\",IF(P30=\"Ja\",\"hoog\",IF(P9>'2. Landbouw'!$N$50,IF('2. Landbouw'!$K$31=Invoer!$C$14,\"midden\",\"laag\"),\"hoog\")),\"\")","v":""}]
[]
[null,null,{"$f":"IF(OR(veedrenking=\"Nee\", ISBLANK(veedrenking)),\n    \"Er is geen sprake van vee drenking.\",\n    _xlfn.CONCAT(\"Het is aan de gebruiker om te bepalen of vee drenking een extra risico vormt voor hoe om te gaan met de zoet-zout dynamiek. \",\n    \"Een gangbare maatstaf (o.b.v. een deskundingenoordeel van The Salt Doctors) is dat vee drenking pas bij een concentratie boven de 1000 mg Cl/l tot risico's kan leiden.\"))","v":"Er is geen sprake van vee drenking."}]

{"sheet":"Risicolegger KRW","index":8,"n_rows":67,"n_cols":39,"rows_kept":67,"cut":false,"hidden":false,"merged":[[8,10,8,14],[32,10,32,14],[79,10,79,14],[55,10,55,14],[22,0,43,0],[1,0,20,0],[45,0,67,0],[31,22,31,26],[31,28,31,32],[31,34,31,38],[54,22,54,26],[54,28,54,32],[54,34,54,38]]}
[]
["ABIOTISCHE GEVOELIGHEID\n- HUIDIGE SITUATIE -"]
[null,null,"Oordeelsblok 1: abiotische gevoeligheid zoutgehalte huidige situatie",null,null,null,null,null,null,null,null,"N.B.: De verstoring wordt pas beoordeeld in BLOK 3."]
[]
[null,null,"In dit eerste blok ziet u de risicobepaling voor de ingevoerde KRW doelen en habitattypen in de huidige situatie op ABIOTIEK."]
[null,null,"Om uitvoer te zien, dient u te hebben aangegeven welk(e) KRW doel(en) en/of habitattype(n) u wilt doorlichten, wat de huidige staat van kwaliteit is, wat de eigenschappen zijn van de waterbodem en wat de zoutsituatie is."]
[]
[null,null,"Samenvatting eigenschappen KRW-doeltypen"]
[null,null,"Het risico wordt bepaald door het bodemtype, de aanwezigheid van een organische sliblaag en de ontstaansgeschiedenis. Voor bodemtype, zie tabblad 3. KRW - waterbodem.",null,null,null,null,null,null,null,"Risico's"]
[null,null,"KRW-doeltypen",null,"Bodemtype",null,"Organische sliblaag",null,"Ontstaansgeschiedenis",null,"Interne eutrofiëring",null,"Sulfidetoxiciteit",null,"Ammoniumtoxiciteit"]
[null,null,{"$f":"_xlfn._xlws.FILTER('3. KRW'!C12:C31,'3. KRW'!H12:H31=1,\"Er zijn nog geen KRW doeltypen geselecteerd (zie tabblad 3. KRW).\")","v":"Er zijn nog geen KRW doeltypen geselecteerd (zie tabblad 3. KRW)."},null,{"$f":"IF(AND(C11<>\"\",R11=1),IF(bool_KRW_bodemtype=\"Ja\",bodemtype,'3. KRW'!J49),\"\")","v":""},null,{"$f":"IF(AND(C11<>\"\",R11=1),'3. KRW'!J59,\"\")","v":""},null,{"$f":"IF(AND(C11<>\"\",R11=1),_xlfn.CONCAT('1. Algemeen'!$K$21,\" - \",'1. Algemeen'!$K$23),\"\")","v":""},null,{"$f":"IF(AND(C11<>\"\",R11=1,S11=1),IF(I11=\"Brak - Brak\", \"laag\",\n   IF(AND(I11=\"Brak - Zoet\", OR(E11=\"Veen\", G11=\"Ja\")), \"midden\",\n   IF(I11=\"Zoet - Zoet\",\n       IF(OR(E11=\"Veen\", G11=\"Ja\"), \"hoog\",\n       IF(E11=\"Klei\", \"midden\", \"laag\")),\n   \"laag\"))),\"-\")","v":"-"},null,{"$f":"IF(AND(C11<>\"\",R11=1,S11=1),IF(I11=\"Brak - Brak\", \"laag\",\n   IF(AND(I11=\"Brak - Zoet\", OR(E11=\"Veen\", G11=\"Ja\")), \"midden\",\n   IF(I11=\"Zoet - Zoet\",\n       IF(OR(E11=\"Veen\", G11=\"Ja\"), \"hoog\",\n       IF(E11=\"Klei\", \"laag\", \"laag\")),\n   \"laag\"))),\"-\")","v":"-"},null,{"$f":"IF(AND(C11<>\"\",R11=1,S11=1),IF(I11=\"Brak - Brak\", \"laag\",\n   IF(AND(I11=\"Brak - Zoet\", OR(E11=\"Veen\", G11=\"Ja\")), \"midden\",\n   IF(I11=\"Zoet - Zoet\",\n       IF(OR(E11=\"Veen\", G11=\"Ja\"), \"hoog\",\n       IF(E11=\"Klei\", \"laag\", \"laag\")),\n   \"laag\"))),\"-\")","v":"-"},null,null,{"$f":"IF(LEFT(C11,1)=\"E\",0,1)","v":0},{"$f":"IF(OR(E11=0,G11=0,I11=\"-\"),0,1)","v":1},{"$f":"IF(C11<>\"\",1,0)","v":1}]
[null,null,null,null,{"$f":"IF(C12<>\"\",IF(bool_KRW_bodemtype=\"Ja\",bodemtype,'3. KRW'!J50),\"\")","v":""},null,{"$f":"IF(C12<>\"\",'3. KRW'!J60,\"\")","v":""},null,{"$f":"IF(C12<>\"\",_xlfn.CONCAT('1. Algemeen'!$K$21,\" - \",'1. Algemeen'!$K$23),\"\")","v":""},null,{"$f":"IF(AND(C12<>\"\",S12=1),IF(I12=\"Brak - Brak\", \"laag\",\n   IF(AND(I12=\"Brak - Zoet\", OR(E12=\"Veen\", G12=\"Ja\")), \"midden\",\n   IF(I12=\"Zoet - Zoet\",\n       IF(OR(E12=\"Veen\", G12=\"Ja\"), \"hoog\",\n       IF(E12=\"Klei\", \"midden\", \"laag\")),\n   \"laag\"))),\"-\")","v":"-"},null,{"$f":"IF(AND(C12<>\"\",S12=1),IF(I12=\"Brak - Brak\", \"laag\",\n   IF(AND(I12=\"Brak - Zoet\", OR(E12=\"Veen\", G12=\"Ja\")), \"midden\",\n   IF(I12=\"Zoet - Zoet\",\n       IF(OR(E12=\"Veen\", G12=\"Ja\"), \"hoog\",\n       IF(E12=\"Klei\", \"laag\", \"laag\")),\n   \"laag\"))),\"-\")","v":"-"},null,{"$f":"IF(AND(C12<>\"\",S12=1),IF(I12=\"Brak - Brak\", \"laag\",\n   IF(AND(I12=\"Brak - Zoet\", OR(E12=\"Veen\", G12=\"Ja\")), \"midden\",\n   IF(I12=\"Zoet - Zoet\",\n       IF(OR(E12=\"Veen\", G12=\"Ja\"), \"hoog\",\n       IF(E12=\"Klei\", \"laag\", \"laag\")),\n   \"laag\"))),\"-\")","v":"-"},null,null,null,{"$f":"IF(OR(E12=0,G12=0,I12=\"-\"),0,1)","v":1},0]
[null,null,null,null,{"$f":"IF(C13<>\"\",IF(bool_KRW_bodemtype=\"Ja\",bodemtype,'3. KRW'!J51),\"\")","v":""},null,{"$f":"IF(C13<>\"\",'3. KRW'!J61,\"\")","v":""},null,{"$f":"IF(C13<>\"\",_xlfn.CONCAT('1. Algemeen'!$K$21,\" - \",'1. Algemeen'!$K$23),\"\")","v":""},null,{"$f":"IF(AND(C13<>\"\",S13=1),IF(I13=\"Brak - Brak\", \"laag\",\n   IF(AND(I13=\"Brak - Zoet\", OR(E13=\"Veen\", G13=\"Ja\")), \"midden\",\n   IF(I13=\"Zoet - Zoet\",\n       IF(OR(E13=\"Veen\", G13=\"Ja\"), \"hoog\",\n       IF(E13=\"Klei\", \"midden\", \"laag\")),\n   \"laag\"))),\"-\")","v":"-"},null,{"$f":"IF(AND(C13<>\"\",S13=1),IF(I13=\"Brak - Brak\", \"laag\",\n   IF(AND(I13=\"Brak - Zoet\", OR(E13=\"Veen\", G13=\"Ja\")), \"midden\",\n   IF(I13=\"Zoet - Zoet\",\n       IF(OR(E13=\"Veen\", G13=\"Ja\"), \"hoog\",\n       IF(E13=\"Klei\", \"laag\", \"laag\")),\n   \"laag\"))),\"-\")","v":"-"},null,{"$f":"IF(AND(C13<>\"\",S13=1),IF(I13=\"Brak - Brak\", \"laag\",\n   IF(AND(I13=\"Brak - Zoet\", OR(E13=\"Veen\", G13=\"Ja\")), \"midden\",\n   IF(I13=\"Zoet - Zoet\",\n       IF(OR(E13=\"Veen\", G13=\"Ja\"), \"hoog\",\n       IF(E13=\"Klei\", \"laag\", \"laag\")),\n   \"laag\"))),\"-\")","v":"-"},null,null,null,1,0]
[null,null,null,null,{"$f":"IF(C14<>\"\",IF(bool_KRW_bodemtype=\"Ja\",bodemtype,'3. KRW'!J52),\"\")","v":""},null,{"$f":"IF(C14<>\"\",'3. KRW'!J62,\"\")","v":""},null,{"$f":"IF(C14<>\"\",_xlfn.CONCAT('1. Algemeen'!$K$21,\" - \",'1. Algemeen'!$K$23),\"\")","v":""},null,{"$f":"IF(AND(C14<>\"\",S14=1),IF(I14=\"Brak - Brak\", \"laag\",\n   IF(AND(I14=\"Brak - Zoet\", OR(E14=\"Veen\", G14=\"Ja\")), \"midden\",\n   IF(I14=\"Zoet - Zoet\",\n       IF(OR(E14=\"Veen\", G14=\"Ja\"), \"hoog\",\n       IF(E14=\"Klei\", \"midden\", \"laag\")),\n   \"laag\"))),\"-\")","v":"-"},null,{"$f":"IF(AND(C14<>\"\",S14=1),IF(I14=\"Brak - Brak\", \"laag\",\n   IF(AND(I14=\"Brak - Zoet\", OR(E14=\"Veen\", G14=\"Ja\")), \"midden\",\n   IF(I14=\"Zoet - Zoet\",\n       IF(OR(E14=\"Veen\", G14=\"Ja\"), \"hoog\",\n       IF(E14=\"Klei\", \"laag\", \"laag\")),\n   \"laag\"))),\"-\")","v":"-"},null,{"$f":"IF(AND(C14<>\"\",S14=1),IF(I14=\"Brak - Brak\", \"laag\",\n   IF(AND(I14=\"Brak - Zoet\", OR(E14=\"Veen\", G14=\"Ja\")), \"midden\",\n   IF(I14=\"Zoet - Zoet\",\n       IF(OR(E14=\"Veen\", G14=\"Ja\"), \"hoog\",\n       IF(E14=\"Klei\", \"laag\", \"laag\")),\n   \"laag\"))),\"-\")","v":"-"},null,null,null,1,0]
[null,null,null,null,{"$f":"IF(C15<>\"\",IF(bool_KRW_bodemtype=\"Ja\",bodemtype,'3. KRW'!J53),\"\")","v":""},null,{"$f":"IF(C15<>\"\",'3. KRW'!J63,\"\")","v":""},null,{"$f":"IF(C15<>\"\",_xlfn.CONCAT('1. Algemeen'!$K$21,\" - \",'1. Algemeen'!$K$23),\"\")","v":""},null,{"$f":"IF(AND(C15<>\"\",S15=1),IF(I15=\"Brak - Brak\", \"laag\",\n   IF(AND(I15=\"Brak - Zoet\", OR(E15=\"Veen\", G15=\"Ja\")), \"midden\",\n   IF(I15=\"Zoet - Zoet\",\n       IF(OR(E15=\"Veen\", G15=\"Ja\"), \"hoog\",\n       IF(E15=\"Klei\", \"midden\", \"laag\")),\n   \"laag\"))),\"-\")","v":"-"},null,{"$f":"IF(AND(C15<>\"\",S15=1),IF(I15=\"Brak - Brak\", \"laag\",\n   IF(AND(I15=\"Brak - Zoet\", OR(E15=\"Veen\", G15=\"Ja\")), \"midden\",\n   IF(I15=\"Zoet - Zoet\",\n       IF(OR(E15=\"Veen\", G15=\"Ja\"), \"hoog\",\n       IF(E15=\"Klei\", \"laag\", \"laag\")),\n   \"laag\"))),\"-\")","v":"-"},null,{"$f":"IF(AND(C15<>\"\",S15=1),IF(I15=\"Brak - Brak\", \"laag\",\n   IF(AND(I15=\"Brak - Zoet\", OR(E15=\"Veen\", G15=\"Ja\")), \"midden\",\n   IF(I15=\"Zoet - Zoet\",\n       IF(OR(E15=\"Veen\", G15=\"Ja\"), \"hoog\",\n       IF(E15=\"Klei\", \"laag\", \"laag\")),\n   \"laag\"))),\"-\")","v":"-"},null,null,null,1,0]
[null,null,null,null,null,null,null,null,null,null,null,null,null,null,null,null,null,null,0,1]
[null,null,"N2000 habitattypen",null,"Bodemtype",null,"Organische sliblaag",null,"Ontstaansgeschiedenis",null,"Interne eutrofiëring",null,"Sulfidetoxiciteit",null,"Ammoniumtoxiciteit",null,null,null,1,1]
[null,null,{"$f":"_xlfn._xlws.FILTER('3. KRW'!C35:C36,'3. KRW'!H35:H36=1,\"Er zijn nog geen habitattypen geselecteerd (zie tabblad 3. KRW).\")","v":"Er zijn nog geen habitattypen geselecteerd (zie tabblad 3. KRW)."},null,{"$f":"IF(AND(C18<>\"\",R18=1),IF(bool_KRW_bodemtype=\"Ja\",bodemtype,'3. KRW'!J54),\"\")","v":""},null,{"$f":"IF(AND(C18<>\"\",R18=1),'3. KRW'!J64,\"\")","v":""},null,{"$f":"IF(AND(C18<>\"\",R18=1),_xlfn.CONCAT('1. Algemeen'!$K$21,\" - \",'1. Algemeen'!$K$23),\"\")","v":""},null,{"$f":"IF(AND(C18<>\"\",R18=1,S18=1),IF(I18=\"Brak - Brak\", \"laag\",\n   IF(AND(I18=\"Brak - Zoet\", OR(E18=\"Veen\", G18=\"Ja\")), \"midden\",\n   IF(I18=\"Zoet - Zoet\",\n       IF(OR(E18=\"Veen\", G18=\"Ja\"), \"hoog\",\n       IF(E18=\"Klei\", \"midden\", \"laag\")),\n   \"laag\"))),\"-\")","v":"-"},null,{"$f":"IF(AND(C18<>\"\",R18=1,S18=1),IF(I18=\"Brak - Brak\", \"laag\",\n   IF(AND(I18=\"Brak - Zoet\", OR(E18=\"Veen\", G18=\"Ja\")), \"midden\",\n   IF(I18=\"Zoet - Zoet\",\n       IF(OR(E18=\"Veen\", G18=\"Ja\"), \"hoog\",\n       IF(E18=\"Klei\", \"laag\", \"laag\")),\n   \"laag\"))),\"-\")","v":"-"},null,{"$f":"IF(AND(C18<>\"\",R18=1,S18=1),IF(I18=\"Brak - Brak\", \"laag\",\n   IF(AND(I18=\"Brak - Zoet\", OR(E18=\"Veen\", G18=\"Ja\")), \"midden\",\n   IF(I18=\"Zoet - Zoet\",\n       IF(OR(E18=\"Veen\", G18=\"Ja\"), \"hoog\",\n       IF(E18=\"Klei\", \"laag\", \"laag\")),\n   \"laag\"))),\"-\")","v":"-"},null,null,{"$f":"IF(LEFT(C18,1)=\"E\",0,1)","v":0},1,1]
[null,null,null,null,{"$f":"IF(C19<>\"\",IF(bool_KRW_bodemtype=\"Ja\",bodemtype,'3. KRW'!J55),\"\")","v":""},null,{"$f":"IF(C19<>\"\",'3. KRW'!J65,\"\")","v":""},null,{"$f":"IF(C19<>\"\",_xlfn.CONCAT('1. Algemeen'!$K$21,\" - \",'1. Algemeen'!$K$23),\"\")","v":""},null,{"$f":"IF(AND(C19<>\"\",S19=1),IF(I19=\"Brak - Brak\", \"laag\",\n   IF(AND(I19=\"Brak - Zoet\", OR(E19=\"Veen\", G19=\"Ja\")), \"midden\",\n   IF(I19=\"Zoet - Zoet\",\n       IF(OR(E19=\"Veen\", G19=\"Ja\"), \"hoog\",\n       IF(E19=\"Klei\", \"midden\", \"laag\")),\n   \"laag\"))),\"-\")","v":"-"},null,{"$f":"IF(AND(C19<>\"\",S19=1),IF(I19=\"Brak - Brak\", \"laag\",\n   IF(AND(I19=\"Brak - Zoet\", OR(E19=\"Veen\", G19=\"Ja\")), \"midden\",\n   IF(I19=\"Zoet - Zoet\",\n       IF(OR(E19=\"Veen\", G19=\"Ja\"), \"hoog\",\n       IF(E19=\"Klei\", \"laag\", \"laag\")),\n   \"laag\"))),\"-\")","v":"-"},null,{"$f":"IF(AND(C19<>\"\",S19=1),IF(I19=\"Brak - Brak\", \"laag\",\n   IF(AND(I19=\"Brak - Zoet\", OR(E19=\"Veen\", G19=\"Ja\")), \"midden\",\n   IF(I19=\"Zoet - Zoet\",\n       IF(OR(E19=\"Veen\", G19=\"Ja\"), \"hoog\",\n       IF(E19=\"Klei\", \"laag\", \"laag\")),\n   \"laag\"))),\"-\")","v":"-"},null,null,null,1,0]
[null,null,null,null,null,null,null,null,null,null,null,null,null,null,null,null,null,null,null,1]
[null,null,null,null,null,null,null,null,null,null,null,null,null,null,null,null,null,null,null,1]
[null,null,null,null,null,null,null,null,null,null,null,null,null,null,null,null,null,null,null,1]
["BLOK 2: BIOTISCHE GEVOELIGHEID\n- HUIDIGE SITUATIE -",null,null,null,null,null,null,null,null,null,null,null,null,null,null,null,null,null,null,1]
[null,null,"Oordeelsblok 2: biotische gevoeligheid zoutgehalte HUIDIGE situatie",null,null,null,null,null,null,null,null,"N.B.: De verstoring wordt pas beoordeeld in BLOK 3.",null,null,null,null,null,null,null,1,null,"Onderbouwing risico inschatting: biotische gevoeligheid zoutgehalte HUIDIGE situatie"]
[null,null,null,null,null,null,null,null,null,null,null,null,null,null,null,null,null,null,null,1]
[null,null,"In dit blok ziet u de risicobepaling voor de ingevoerde KRW doelen en habitattypen in de huidige situatie op BIOTIEK.",null,null,null,null,null,null,null,null,null,null,null,null,null,null,null,null,1,null,"In dit blok ziet u de verdere onderbouwing van de risicobepaling voor de ingevoerde KRW doelen en habitattypen in de huidige situatie op BIOTIEK."]
[null,null,"Om uitvoer te zien, dient u te hebben aangegeven welk(e) KRW doel(en) en/of habitattype(n) u wilt doorlichten, wat de huidige staat van kwaliteit is, wat de eigenschappen zijn van de waterbodem en wat de zoutsituatie is.",null,null,null,null,null,null,null,null,null,null,null,null,null,null,null,null,1,null,"Om uitvoer te zien, dient u te hebben aangegeven welk(e) KRW doel(en) en/of habitattype(n) u wilt doorlichten, wat de huidige staat van kwaliteit is, wat de eigenschappen zijn van de waterbodem en wat de zoutsituatie is."]
[null,null,"Voor het maken van de risicobepaling, wordt het zoutgehalte van het oppervlaktewater vergeleken met de grenswaarden voor verzilting/verzoeting van de ingevoerde KRW doelen en habitattypen. ",null,null,null,null,null,null,null,null,null,null,null,null,null,null,null,null,1]
[null,null,null,null,null,null,null,null,null,null,null,null,null,null,null,null,null,null,null,1]
[null,null,{"$f":"IF(eenheid_zoutgehalte_algemeen<>\"\",_xlfn.CONCAT(\"De eenheid van het huidige zoutgehalte die door u is opgegeven, is: \"),\n\"De eenheid van het huidige zoutgehalte is onbekend. Risico inschatting niet mogelijk.\")","v":"De eenheid van het huidige zoutgehalte is onbekend. Risico inschatting niet mogelijk."},null,{"$f":"IF(eenheid_zoutgehalte_algemeen=\"\",\"onbekend\", eenheid_zoutgehalte_algemeen)","v":"onbekend"},null,null,"Maximaal huidig zoutgehalte:",{"$f":"IF(maximaal_zout_huidig<>0,IF(R30=1,165*maximaal_zout_huidig^1.3438,maximaal_zout_huidig),\"niet opgegeven\")","v":"niet opgegeven"},{"$f":"IF(R30=1,\"mg Cl/l\",IF(R30=2,\"mg Cl/l\",\"eenheid onbekend\"))","v":"eenheid onbekend"},null,"N.B.: Onderbouwing risico's staat in het blok rechts.",null,null,null,null,null,{"$f":"IF(E30=\"EC-waarde\",1,IF(E30=\"Chloridegehalte\",2,0))","v":0},null,1,null,"Onderstaande tabel geeft weer welke zaken onderliggend zijn aan de risicobepaling in het oordeelsblok 2 (zie links). Deze onderbouwing berust op een deskundigenoordeel (Van Geest Ecologie + B-Ware)."]
[null,null,{"$f":"IF(R30=1,\"De ingevulde EC waardes worden voor de functie aquatische natuur omgerekend naar chloridegehaltes.\",\"\")","v":""},null,null,null,null,null,null,null,null,null,null,null,null,null,null,null,null,1]
[null,null,"Risicobepaling",null,null,null,null,null,null,null,null,null,null,null,null,null,null,null,null,1,null,null,"Voorjaar",null,null,null,null,null,"Zomer",null,null,null,null,null,"Winter"]
[null,null,"Risicobepaling van het huidige maximale zoutgehalte in relatie tot de zoutsituatie.",null,null,null,null,null,null,null,"Risico's t.a.v. verzilting",null,null,null,null,null,null,null,null,1,null,null,{"$f":"'Grenswaarden KRW'!G2","v":"Kwetsbare levensfase"},{"$f":"'Grenswaarden KRW'!H2","v":"Sterfte soorten"},{"$f":"'Grenswaarden KRW'!I2","v":"Oplading waterbodem"},{"$f":"'Grenswaarden KRW'!J2","v":"Afname waterplanten"},{"$f":"'Grenswaarden KRW'!K2","v":"Voedselweb/Daphnia"},null,{"$f":"W33","v":"Kwetsbare levensfase"},{"$f":"X33","v":"Sterfte soorten"},{"$f":"Y33","v":"Oplading waterbodem"},{"$f":"Z33","v":"Afname waterplanten"},{"$f":"AA33","v":"Voedselweb/Daphnia"},null,{"$f":"AC33","v":"Kwetsbare levensfase"},"Sterfte soorten","Oplading waterbodem",{"$f":"AF33","v":"Afname waterplanten"},{"$f":"AG33","v":"Voedselweb/Daphnia"}]
[null,null,"KRW-doeltypen",null,null,null,"Huidige zoutsituatie",null,null,null,"Voorjaar",null,"Zomer",null,"Winter",null,null,null,null,1]
[null,null,{"$f":"_xlfn._xlws.FILTER('3. KRW'!C12:C31,'3. KRW'!H12:H31=1,\"Er zijn nog geen KRW doeltypen geselecteerd (zie tabblad 3. KRW).\")","v":"Er zijn nog geen KRW doeltypen geselecteerd (zie tabblad 3. KRW)."},null,null,null,{"$f":"IF(AND(C35<>\"\",R35=1,'3. KRW'!J77<>\"\"),'3. KRW'!J77,\"-\")","v":"-"},null,{"$f":"IF('3. KRW'!K77=\"X\",\"X\",\"\")","v":""},null,{"$f":"IF(AND(G35<>\"-\",G35<>0,$I$30<>\"niet opgegeven\"),IF(S35=1, IF($I$30>300, \"zeer sterk\", \"geen\"),\n   IF(OR(S35=2, S35=3),\n      IF($I$30<=1000, \"geen\",\n      IF(AND($I$30>1000, $I$30<=10000), \"sterk\",\n      IF($I$30>10000, \"zeer sterk\", \"geen\"))),\n   IF(S35=4,\n      IF($I$30<=3000, \"geen\",\n      IF($I$30>3000, \"sterk\")),\n   IF(S35=5,\n      IF($I$30<=10000, \"geen\",\n      IF($I$30>10000, \"klein\")),\n   IF(S35=6, \"geen\", \"geen\"))))),\"-\")","v":"-"},null,{"$f":"IF(AND(G35<>\"-\",G35<>0,$I$30<>\"niet opgegeven\"),IF(S35=1,\n    IF(AND($I$30>300, $I$30<=3000), \"sterk\",\n    IF($I$30>3000, \"zeer sterk\", \"geen\")),\n\n    IF(S35=2,\n        IF(AND($I$30>300, $I$30<=1000), \"geen\",\n        IF($I$30>1000, \"sterk\", \"geen\")),\n\n        IF(S35=3,\n            IF(AND($I$30>300, $I$30<=3000), \"matig\",\n            IF(AND($I$30>3000, $I$30<=10000), \"sterk\",\n            IF($I$30>10000, \"zeer sterk\", \"geen\"))),\n\n            IF(S35=4,\n                IF($I$30<=3000, \"geen\",\n                IF($I$30>3000, \"sterk\")),\n\n                IF(S35=5,\n                    IF($I$30<=10000, \"geen\",\n                    IF($I$30>10000, \"klein\")),\n\n                    IF(S35=6, \"geen\", \"geen\")))))),\"-\")","v":"-"},null,{"$f":"IF(AND(G35<>\"-\",G35<>0,$I$30<>\"niet opgegeven\"),IF(S35=1,\n    IF(AND($I$30>300, $I$30<=3000), \"matig\",\n    IF($I$30>3000, \"sterk\", \"geen\")),\n\n    IF(S35=2,\n        IF(AND($I$30>300, $I$30<=1000), \"geen\",\n        IF(AND($I$30>1000, $I$30<=3000), \"klein\",\n        IF(AND($I$30>3000, $I$30<=10000), \"matig\",\n        IF($I$30>10000, \"sterk\", \"geen\")))),\n\n        IF(S35=3,\n            IF(AND($I$30>1000, $I$30<=3000), \"geen\",\n            IF(AND($I$30>3000, $I$30<=10000), \"klein\",\n            IF($I$30>10000, \"sterk\", \"klein\"))),\n\n            IF(S35=4,\n                IF($I$30<=3000, \"geen\",\n                IF(AND($I$30>3000, $I$30<=10000), \"klein\",\n                IF($I$30>10000, \"sterk\"))),\n\n                IF(S35=5,\n                    IF($I$30<=10000, \"geen\",\n                    IF($I$30>10000, \"klein\")),\n\n                    IF(S35=6, \"geen\", \"geen\")))))),\"-\")","v":"-"},null,null,{"$f":"IF(LEFT(C11,1)=\"E\",0,1)","v":0},{"$f":"_xlfn.XLOOKUP(G35,Invoer!$I$34:$I$39,Invoer!$J$34:$J$39)","v":{"$error":"#N/A"}},{"$f":"IF(C35<>\"\",1,0)","v":1},null,{"$f":"IF(G35<>\"\",G35,\"-\")","v":"-"},{"$f":"IF($V35<>\"-\",_xlfn.XLOOKUP(1,(('Grenswaarden KRW'!$B:$B=$V35)*('Grenswaarden KRW'!$C:$C=$K35)),'Grenswaarden KRW'!G:G, \"Nee\"),\"-\")","v":"-"},{"$f":"IF($V35<>\"-\",_xlfn.XLOOKUP(1,(('Grenswaarden KRW'!$B:$B=$V35)*('Grenswaarden KRW'!$C:$C=$K35)),'Grenswaarden KRW'!H:H, \"Nee\"),\"-\")","v":"-"},{"$f":"IF($V35<>\"-\",_xlfn.XLOOKUP(1,(('Grenswaarden KRW'!$B:$B=$V35)*('Grenswaarden KRW'!$C:$C=$K35)),'Grenswaarden KRW'!I:I, \"Nee\"),\"-\")","v":"-"},{"$f":"IF($V35<>\"-\",_xlfn.XLOOKUP(1,(('Grenswaarden KRW'!$B:$B=$V35)*('Grenswaarden KRW'!$C:$C=$K35)),'Grenswaarden KRW'!J:J, \"Nee\"),\"-\")","v":"-"},{"$f":"IF($V35<>\"-\",_xlfn.XLOOKUP(1,(('Grenswaarden KRW'!$B:$B=$V35)*('Grenswaarden KRW'!$C:$C=$K35)),'Grenswaarden KRW'!K:K, \"Nee\"),\"-\")","v":"-"},null,{"$f":"IF($V35<>\"-\",_xlfn.XLOOKUP(1,(('Grenswaarden KRW'!$B:$B=$V35)*('Grenswaarden KRW'!$D:$D=$M35)),'Grenswaarden KRW'!G:G, \"Nee\"),\"-\")","v":"-"},{"$f":"IF($V35<>\"-\",_xlfn.XLOOKUP(1,(('Grenswaarden KRW'!$B:$B=$V35)*('Grenswaarden KRW'!$D:$D=$M35)),'Grenswaarden KRW'!H:H, \"Nee\"),\"-\")","v":"-"},{"$f":"IF($V35<>\"-\",_xlfn.XLOOKUP(1,(('Grenswaarden KRW'!$B:$B=$V35)*('Grenswaarden KRW'!$D:$D=$M35)),'Grenswaarden KRW'!I:I, \"Nee\"),\"-\")","v":"-"},{"$f":"IF($V35<>\"-\",_xlfn.XLOOKUP(1,(('Grenswaarden KRW'!$B:$B=$V35)*('Grenswaarden KRW'!$D:$D=$M35)),'Grenswaarden KRW'!J:J, \"Nee\"),\"-\")","v":"-"},{"$f":"IF($V35<>\"-\",_xlfn.XLOOKUP(1,(('Grenswaarden KRW'!$B:$B=$V35)*('Grenswaarden KRW'!$D:$D=$M35)),'Grenswaarden KRW'!K:K, \"Nee\"),\"-\")","v":"-"},null,{"$f":"IF($V35<>\"-\",_xlfn.XLOOKUP(1,(('Grenswaarden KRW'!$B:$B=$V35)*('Grenswaarden KRW'!$E:$E=$O35)),'Grenswaarden KRW'!G:G, \"Nee\"),\"-\")","v":"-"},{"$f":"IF($V35<>\"-\",_xlfn.XLOOKUP(1,(('Grenswaarden KRW'!$B:$B=$V35)*('Grenswaarden KRW'!$E:$E=$O35)),'Grenswaarden KRW'!H:H, \"Nee\"),\"-\")","v":"-"},{"$f":"IF($V35<>\"-\",_xlfn.XLOOKUP(1,(('Grenswaarden KRW'!$B:$B=$V35)*('Grenswaarden KRW'!$E:$E=$O35)),'Grenswaarden KRW'!I:I, \"Nee\"),\"-\")","v":"-"},{"$f":"IF($V35<>\"-\",_xlfn.XLOOKUP(1,(('Grenswaarden KRW'!$B:$B=$V35)*('Grenswaarden KRW'!$E:$E=$O35)),'Grenswaarden KRW'!J:J, \"Nee\"),\"-\")","v":"-"},{"$f":"IF($V35<>\"-\",_xlfn.XLOOKUP(1,(('Grenswaarden KRW'!$B:$B=$V35)*('Grenswaarden KRW'!$E:$E=$O35)),'Grenswaarden KRW'!K:K, \"Nee\"),\"-\")","v":"-"}]
[null,null,null,null,null,null,{"$f":"IF(AND(C36<>\"\",R36=1,'3. KRW'!J78<>\"\"),'3. KRW'!J78,\"-\")","v":"-"},null,{"$f":"IF('3. KRW'!K78=\"X\",\"X\",\"\")","v":""},null,{"$f":"IF(AND(G36<>\"-\",G36<>0,$I$30<>\"niet opgegeven\"),IF(S36=1, IF($I$30>300, \"zeer sterk\", \"geen\"),\n   IF(OR(S36=2, S36=3),\n      IF($I$30<=1000, \"geen\",\n      IF(AND($I$30>1000, $I$30<=10000), \"sterk\",\n      IF($I$30>10000, \"zeer sterk\", \"geen\"))),\n   IF(S36=4,\n      IF($I$30<=3000, \"geen\",\n      IF($I$30>3000, \"sterk\")),\n   IF(S36=5,\n      IF($I$30<=10000, \"geen\",\n      IF($I$30>10000, \"klein\")),\n   IF(S36=6, \"geen\", \"geen\"))))),\"-\")","v":"-"},null,{"$f":"IF(AND(G36<>\"-\",G36<>0,$I$30<>\"niet opgegeven\"),IF(S36=1,\n    IF(AND($I$30>300, $I$30<=3000), \"sterk\",\n    IF($I$30>3000, \"zeer sterk\", \"geen\")),\n\n    IF(S36=2,\n        IF(AND($I$30>300, $I$30<=1000), \"geen\",\n        IF($I$30>1000, \"sterk\", \"geen\")),\n\n        IF(S36=3,\n            IF(AND($I$30>300, $I$30<=3000), \"matig\",\n            IF(AND($I$30>3000, $I$30<=10000), \"sterk\",\n            IF($I$30>10000, \"zeer sterk\", \"geen\"))),\n\n            IF(S36=4,\n                IF($I$30<=3000, \"geen\",\n                IF($I$30>3000, \"sterk\")),\n\n                IF(S36=5,\n                    IF($I$30<=10000, \"geen\",\n                    IF($I$30>10000, \"klein\")),\n\n                    IF(S36=6, \"geen\", \"geen\")))))),\"-\")","v":"-"},null,{"$f":"IF(AND(G36<>\"-\",G36<>0,$I$30<>\"niet opgegeven\"),IF(S36=1,\n    IF(AND($I$30>300, $I$30<=3000), \"matig\",\n    IF($I$30>3000, \"sterk\", \"geen\")),\n\n    IF(S36=2,\n        IF(AND($I$30>300, $I$30<=1000), \"geen\",\n        IF(AND($I$30>1000, $I$30<=3000), \"klein\",\n        IF(AND($I$30>3000, $I$30<=10000), \"matig\",\n        IF($I$30>10000, \"sterk\", \"geen\")))),\n\n        IF(S36=3,\n            IF(AND($I$30>1000, $I$30<=3000), \"geen\",\n            IF(AND($I$30>3000, $I$30<=10000), \"klein\",\n            IF($I$30>10000, \"sterk\", \"klein\"))),\n\n            IF(S36=4,\n                IF($I$30<=3000, \"geen\",\n                IF(AND($I$30>3000, $I$30<=10000), \"klein\",\n                IF($I$30>10000, \"sterk\"))),\n\n                IF(S36=5,\n                    IF($I$30<=10000, \"geen\",\n                    IF($I$30>10000, \"klein\")),\n\n                    IF(S36=6, \"geen\", \"geen\")))))),\"-\")","v":"-"},null,null,{"$f":"IF(LEFT(C12,1)=\"E\",0,1)","v":1},{"$f":"_xlfn.XLOOKUP(G36,Invoer!$I$34:$I$39,Invoer!$J$34:$J$39)","v":{"$error":"#N/A"}},{"$f":"IF(C36<>\"\",1,0)","v":0},null,{"$f":"IF(G36<>\"\",G36,\"-\")","v":"-"},{"$f":"IF($V36<>\"-\",_xlfn.XLOOKUP(1,(('Grenswaarden KRW'!$B:$B=$V36)*('Grenswaarden KRW'!$C:$C=$K36)),'Grenswaarden KRW'!G:G, \"Nee\"),\"-\")","v":"-"},{"$f":"IF($V36<>\"-\",_xlfn.XLOOKUP(1,(('Grenswaarden KRW'!$B:$B=$V36)*('Grenswaarden KRW'!$C:$C=$K36)),'Grenswaarden KRW'!H:H, \"Nee\"),\"-\")","v":"-"},{"$f":"IF($V36<>\"-\",_xlfn.XLOOKUP(1,(('Grenswaarden KRW'!$B:$B=$V36)*('Grenswaarden KRW'!$C:$C=$K36)),'Grenswaarden KRW'!I:I, \"Nee\"),\"-\")","v":"-"},{"$f":"IF($V36<>\"-\",_xlfn.XLOOKUP(1,(('Grenswaarden KRW'!$B:$B=$V36)*('Grenswaarden KRW'!$C:$C=$K36)),'Grenswaarden KRW'!J:J, \"Nee\"),\"-\")","v":"-"},{"$f":"IF($V36<>\"-\",_xlfn.XLOOKUP(1,(('Grenswaarden KRW'!$B:$B=$V36)*('Grenswaarden KRW'!$C:$C=$K36)),'Grenswaarden KRW'!K:K, \"Nee\"),\"-\")","v":"-"},null,{"$f":"IF($V36<>\"-\",_xlfn.XLOOKUP(1,(('Grenswaarden KRW'!$B:$B=$V36)*('Grenswaarden KRW'!$D:$D=$M36)),'Grenswaarden KRW'!G:G, \"Nee\"),\"-\")","v":"-"},{"$f":"IF($V36<>\"-\",_xlfn.XLOOKUP(1,(('Grenswaarden KRW'!$B:$B=$V36)*('Grenswaarden KRW'!$D:$D=$M36)),'Grenswaarden KRW'!H:H, \"Nee\"),\"-\")","v":"-"},{"$f":"IF($V36<>\"-\",_xlfn.XLOOKUP(1,(('Grenswaarden KRW'!$B:$B=$V36)*('Grenswaarden KRW'!$D:$D=$M36)),'Grenswaarden KRW'!I:I, \"Nee\"),\"-\")","v":"-"},{"$f":"IF($V36<>\"-\",_xlfn.XLOOKUP(1,(('Grenswaarden KRW'!$B:$B=$V36)*('Grenswaarden KRW'!$D:$D=$M36)),'Grenswaarden KRW'!J:J, \"Nee\"),\"-\")","v":"-"},{"$f":"IF($V36<>\"-\",_xlfn.XLOOKUP(1,(('Grenswaarden KRW'!$B:$B=$V36)*('Grenswaarden KRW'!$D:$D=$M36)),'Grenswaarden KRW'!K:K, \"Nee\"),\"-\")","v":"-"},null,{"$f":"IF($V36<>\"-\",_xlfn.XLOOKUP(1,(('Grenswaarden KRW'!$B:$B=$V36)*('Grenswaarden KRW'!$E:$E=$O36)),'Grenswaarden KRW'!G:G, \"Nee\"),\"-\")","v":"-"},{"$f":"IF($V36<>\"-\",_xlfn.XLOOKUP(1,(('Grenswaarden KRW'!$B:$B=$V36)*('Grenswaarden KRW'!$E:$E=$O36)),'Grenswaarden KRW'!H:H, \"Nee\"),\"-\")","v":"-"},{"$f":"IF($V36<>\"-\",_xlfn.XLOOKUP(1,(('Grenswaarden KRW'!$B:$B=$V36)*('Grenswaarden KRW'!$E:$E=$O36)),'Grenswaarden KRW'!I:I, \"Nee\"),\"-\")","v":"-"},{"$f":"IF($V36<>\"-\",_xlfn.XLOOKUP(1,(('Grenswaarden KRW'!$B:$B=$V36)*('Grenswaarden KRW'!$E:$E=$O36)),'Grenswaarden KRW'!J:J, \"Nee\"),\"-\")","v":"-"},{"$f":"IF($V36<>\"-\",_xlfn.XLOOKUP(1,(('Grenswaarden KRW'!$B:$B=$V36)*('Grenswaarden KRW'!$E:$E=$O36)),'Grenswaarden KRW'!K:K, \"Nee\"),\"-\")","v":"-"}]
[null,null,null,null,null,null,{"$f":"IF(AND(C37<>\"\",R37=1,'3. KRW'!J79<>\"\"),'3. KRW'!J79,\"-\")","v":"-"},null,{"$f":"IF('3. KRW'!K79=\"X\",\"X\",\"\")","v":""},null,"-",null,"-",null,"-",null,null,{"$f":"IF(LEFT(C13,1)=\"E\",0,1)","v":1},{"$f":"_xlfn.XLOOKUP(G37,Invoer!$I$34:$I$39,Invoer!$J$34:$J$39)","v":{"$error":"#N/A"}},0,null,"-",{"$f":"IF($V37<>\"-\",_xlfn.XLOOKUP(1,(('Grenswaarden KRW'!$B:$B=$V37)*('Grenswaarden KRW'!$C:$C=$K37)),'Grenswaarden KRW'!G:G, \"Nee\"),\"-\")","v":"-"},{"$f":"IF($V37<>\"-\",_xlfn.XLOOKUP(1,(('Grenswaarden KRW'!$B:$B=$V37)*('Grenswaarden KRW'!$C:$C=$K37)),'Grenswaarden KRW'!H:H, \"Nee\"),\"-\")","v":"-"},{"$f":"IF($V37<>\"-\",_xlfn.XLOOKUP(1,(('Grenswaarden KRW'!$B:$B=$V37)*('Grenswaarden KRW'!$C:$C=$K37)),'Grenswaarden KRW'!I:I, \"Nee\"),\"-\")","v":"-"},{"$f":"IF($V37<>\"-\",_xlfn.XLOOKUP(1,(('Grenswaarden KRW'!$B:$B=$V37)*('Grenswaarden KRW'!$C:$C=$K37)),'Grenswaarden KRW'!J:J, \"Nee\"),\"-\")","v":"-"},{"$f":"IF($V37<>\"-\",_xlfn.XLOOKUP(1,(('Grenswaarden KRW'!$B:$B=$V37)*('Grenswaarden KRW'!$C:$C=$K37)),'Grenswaarden KRW'!K:K, \"Nee\"),\"-\")","v":"-"},null,{"$f":"IF($V37<>\"-\",_xlfn.XLOOKUP(1,(('Grenswaarden KRW'!$B:$B=$V37)*('Grenswaarden KRW'!$D:$D=$M37)),'Grenswaarden KRW'!G:G, \"Nee\"),\"-\")","v":"-"},{"$f":"IF($V37<>\"-\",_xlfn.XLOOKUP(1,(('Grenswaarden KRW'!$B:$B=$V37)*('Grenswaarden KRW'!$D:$D=$M37)),'Grenswaarden KRW'!H:H, \"Nee\"),\"-\")","v":"-"},{"$f":"IF($V37<>\"-\",_xlfn.XLOOKUP(1,(('Grenswaarden KRW'!$B:$B=$V37)*('Grenswaarden KRW'!$D:$D=$M37)),'Grenswaarden KRW'!I:I, \"Nee\"),\"-\")","v":"-"},{"$f":"IF($V37<>\"-\",_xlfn.XLOOKUP(1,(('Grenswaarden KRW'!$B:$B=$V37)*('Grenswaarden KRW'!$D:$D=$M37)),'Grenswaarden KRW'!J:J, \"Nee\"),\"-\")","v":"-"},{"$f":"IF($V37<>\"-\",_xlfn.XLOOKUP(1,(('Grenswaarden KRW'!$B:$B=$V37)*('Grenswaarden KRW'!$D:$D=$M37)),'Grenswaarden KRW'!K:K, \"Nee\"),\"-\")","v":"-"},null,{"$f":"IF($V37<>\"-\",_xlfn.XLOOKUP(1,(('Grenswaarden KRW'!$B:$B=$V37)*('Grenswaarden KRW'!$E:$E=$O37)),'Grenswaarden KRW'!G:G, \"Nee\"),\"-\")","v":"-"},{"$f":"IF($V37<>\"-\",_xlfn.XLOOKUP(1,(('Grenswaarden KRW'!$B:$B=$V37)*('Grenswaarden KRW'!$E:$E=$O37)),'Grenswaarden KRW'!H:H, \"Nee\"),\"-\")","v":"-"},{"$f":"IF($V37<>\"-\",_xlfn.XLOOKUP(1,(('Grenswaarden KRW'!$B:$B=$V37)*('Grenswaarden KRW'!$E:$E=$O37)),'Grenswaarden KRW'!I:I, \"Nee\"),\"-\")","v":"-"},{"$f":"IF($V37<>\"-\",_xlfn.XLOOKUP(1,(('Grenswaarden KRW'!$B:$B=$V37)*('Grenswaarden KRW'!$E:$E=$O37)),'Grenswaarden KRW'!J:J, \"Nee\"),\"-\")","v":"-"},{"$f":"IF($V37<>\"-\",_xlfn.XLOOKUP(1,(('Grenswaarden KRW'!$B:$B=$V37)*('Grenswaarden KRW'!$E:$E=$O37)),'Grenswaarden KRW'!K:K, \"Nee\"),\"-\")","v":"-"}]
[null,null,null,null,null,null,{"$f":"IF(AND(C38<>\"\",R38=1,'3. KRW'!J80<>\"\"),'3. KRW'!J80,\"-\")","v":"-"},null,{"$f":"IF('3. KRW'!K80=\"X\",\"X\",\"\")","v":""},null,"-",null,"-",null,"-",null,null,{"$f":"IF(LEFT(C14,1)=\"E\",0,1)","v":1},{"$f":"_xlfn.XLOOKUP(G38,Invoer!$I$34:$I$39,Invoer!$J$34:$J$39)","v":{"$error":"#N/A"}},0,null,"-",{"$f":"IF($V38<>\"-\",_xlfn.XLOOKUP(1,(('Grenswaarden KRW'!$B:$B=$V38)*('Grenswaarden KRW'!$C:$C=$K38)),'Grenswaarden KRW'!G:G, \"Nee\"),\"-\")","v":"-"},{"$f":"IF($V38<>\"-\",_xlfn.XLOOKUP(1,(('Grenswaarden KRW'!$B:$B=$V38)*('Grenswaarden KRW'!$C:$C=$K38)),'Grenswaarden KRW'!H:H, \"Nee\"),\"-\")","v":"-"},{"$f":"IF($V38<>\"-\",_xlfn.XLOOKUP(1,(('Grenswaarden KRW'!$B:$B=$V38)*('Grenswaarden KRW'!$C:$C=$K38)),'Grenswaarden KRW'!I:I, \"Nee\"),\"-\")","v":"-"},{"$f":"IF($V38<>\"-\",_xlfn.XLOOKUP(1,(('Grenswaarden KRW'!$B:$B=$V38)*('Grenswaarden KRW'!$C:$C=$K38)),'Grenswaarden KRW'!J:J, \"Nee\"),\"-\")","v":"-"},{"$f":"IF($V38<>\"-\",_xlfn.XLOOKUP(1,(('Grenswaarden KRW'!$B:$B=$V38)*('Grenswaarden KRW'!$C:$C=$K38)),'Grenswaarden KRW'!K:K, \"Nee\"),\"-\")","v":"-"},null,{"$f":"IF($V38<>\"-\",_xlfn.XLOOKUP(1,(('Grenswaarden KRW'!$B:$B=$V38)*('Grenswaarden KRW'!$D:$D=$M38)),'Grenswaarden KRW'!G:G, \"Nee\"),\"-\")","v":"-"},{"$f":"IF($V38<>\"-\",_xlfn.XLOOKUP(1,(('Grenswaarden KRW'!$B:$B=$V38)*('Grenswaarden KRW'!$D:$D=$M38)),'Grenswaarden KRW'!H:H, \"Nee\"),\"-\")","v":"-"},{"$f":"IF($V38<>\"-\",_xlfn.XLOOKUP(1,(('Grenswaarden KRW'!$B:$B=$V38)*('Grenswaarden KRW'!$D:$D=$M38)),'Grenswaarden KRW'!I:I, \"Nee\"),\"-\")","v":"-"},{"$f":"IF($V38<>\"-\",_xlfn.XLOOKUP(1,(('Grenswaarden KRW'!$B:$B=$V38)*('Grenswaarden KRW'!$D:$D=$M38)),'Grenswaarden KRW'!J:J, \"Nee\"),\"-\")","v":"-"},{"$f":"IF($V38<>\"-\",_xlfn.XLOOKUP(1,(('Grenswaarden KRW'!$B:$B=$V38)*('Grenswaarden KRW'!$D:$D=$M38)),'Grenswaarden KRW'!K:K, \"Nee\"),\"-\")","v":"-"},null,{"$f":"IF($V38<>\"-\",_xlfn.XLOOKUP(1,(('Grenswaarden KRW'!$B:$B=$V38)*('Grenswaarden KRW'!$E:$E=$O38)),'Grenswaarden KRW'!G:G, \"Nee\"),\"-\")","v":"-"},{"$f":"IF($V38<>\"-\",_xlfn.XLOOKUP(1,(('Grenswaarden KRW'!$B:$B=$V38)*('Grenswaarden KRW'!$E:$E=$O38)),'Grenswaarden KRW'!H:H, \"Nee\"),\"-\")","v":"-"},{"$f":"IF($V38<>\"-\",_xlfn.XLOOKUP(1,(('Grenswaarden KRW'!$B:$B=$V38)*('Grenswaarden KRW'!$E:$E=$O38)),'Grenswaarden KRW'!I:I, \"Nee\"),\"-\")","v":"-"},{"$f":"IF($V38<>\"-\",_xlfn.XLOOKUP(1,(('Grenswaarden KRW'!$B:$B=$V38)*('Grenswaarden KRW'!$E:$E=$O38)),'Grenswaarden KRW'!J:J, \"Nee\"),\"-\")","v":"-"},{"$f":"IF($V38<>\"-\",_xlfn.XLOOKUP(1,(('Grenswaarden KRW'!$B:$B=$V38)*('Grenswaarden KRW'!$E:$E=$O38)),'Grenswaarden KRW'!K:K, \"Nee\"),\"-\")","v":"-"}]
[null,null,null,null,null,null,{"$f":"IF(AND(C39<>\"\",R39=1,'3. KRW'!J81<>\"\"),'3. KRW'!J81,\"-\")","v":"-"},null,{"$f":"IF('3. KRW'!K81=\"X\",\"X\",\"\")","v":""},null,"-",null,"-",null,"-",null,null,{"$f":"IF(LEFT(C15,1)=\"E\",0,1)","v":1},{"$f":"_xlfn.XLOOKUP(G39,Invoer!$I$34:$I$39,Invoer!$J$34:$J$39)","v":{"$error":"#N/A"}},0,null,"-",{"$f":"IF($V39<>\"-\",_xlfn.XLOOKUP(1,(('Grenswaarden KRW'!$B:$B=$V39)*('Grenswaarden KRW'!$C:$C=$K39)),'Grenswaarden KRW'!G:G, \"Nee\"),\"-\")","v":"-"},{"$f":"IF($V39<>\"-\",_xlfn.XLOOKUP(1,(('Grenswaarden KRW'!$B:$B=$V39)*('Grenswaarden KRW'!$C:$C=$K39)),'Grenswaarden KRW'!H:H, \"Nee\"),\"-\")","v":"-"},{"$f":"IF($V39<>\"-\",_xlfn.XLOOKUP(1,(('Grenswaarden KRW'!$B:$B=$V39)*('Grenswaarden KRW'!$C:$C=$K39)),'Grenswaarden KRW'!I:I, \"Nee\"),\"-\")","v":"-"},{"$f":"IF($V39<>\"-\",_xlfn.XLOOKUP(1,(('Grenswaarden KRW'!$B:$B=$V39)*('Grenswaarden KRW'!$C:$C=$K39)),'Grenswaarden KRW'!J:J, \"Nee\"),\"-\")","v":"-"},{"$f":"IF($V39<>\"-\",_xlfn.XLOOKUP(1,(('Grenswaarden KRW'!$B:$B=$V39)*('Grenswaarden KRW'!$C:$C=$K39)),'Grenswaarden KRW'!K:K, \"Nee\"),\"-\")","v":"-"},null,{"$f":"IF($V39<>\"-\",_xlfn.XLOOKUP(1,(('Grenswaarden KRW'!$B:$B=$V39)*('Grenswaarden KRW'!$D:$D=$M39)),'Grenswaarden KRW'!G:G, \"Nee\"),\"-\")","v":"-"},{"$f":"IF($V39<>\"-\",_xlfn.XLOOKUP(1,(('Grenswaarden KRW'!$B:$B=$V39)*('Grenswaarden KRW'!$D:$D=$M39)),'Grenswaarden KRW'!H:H, \"Nee\"),\"-\")","v":"-"},{"$f":"IF($V39<>\"-\",_xlfn.XLOOKUP(1,(('Grenswaarden KRW'!$B:$B=$V39)*('Grenswaarden KRW'!$D:$D=$M39)),'Grenswaarden KRW'!I:I, \"Nee\"),\"-\")","v":"-"},{"$f":"IF($V39<>\"-\",_xlfn.XLOOKUP(1,(('Grenswaarden KRW'!$B:$B=$V39)*('Grenswaarden KRW'!$D:$D=$M39)),'Grenswaarden KRW'!J:J, \"Nee\"),\"-\")","v":"-"},{"$f":"IF($V39<>\"-\",_xlfn.XLOOKUP(1,(('Grenswaarden KRW'!$B:$B=$V39)*('Grenswaarden KRW'!$D:$D=$M39)),'Grenswaarden KRW'!K:K, \"Nee\"),\"-\")","v":"-"},null,{"$f":"IF($V39<>\"-\",_xlfn.XLOOKUP(1,(('Grenswaarden KRW'!$B:$B=$V39)*('Grenswaarden KRW'!$E:$E=$O39)),'Grenswaarden KRW'!G:G, \"Nee\"),\"-\")","v":"-"},{"$f":"IF($V39<>\"-\",_xlfn.XLOOKUP(1,(('Grenswaarden KRW'!$B:$B=$V39)*('Grenswaarden KRW'!$E:$E=$O39)),'Grenswaarden KRW'!H:H, \"Nee\"),\"-\")","v":"-"},{"$f":"IF($V39<>\"-\",_xlfn.XLOOKUP(1,(('Grenswaarden KRW'!$B:$B=$V39)*('Grenswaarden KRW'!$E:$E=$O39)),'Grenswaarden KRW'!I:I, \"Nee\"),\"-\")","v":"-"},{"$f":"IF($V39<>\"-\",_xlfn.XLOOKUP(1,(('Grenswaarden KRW'!$B:$B=$V39)*('Grenswaarden KRW'!$E:$E=$O39)),'Grenswaarden KRW'!J:J, \"Nee\"),\"-\")","v":"-"},{"$f":"IF($V39<>\"-\",_xlfn.XLOOKUP(1,(('Grenswaarden KRW'!$B:$B=$V39)*('Grenswaarden KRW'!$E:$E=$O39)),'Grenswaarden KRW'!K:K, \"Nee\"),\"-\")","v":"-"}]
[null,null,{"$f":"IF(SUMPRODUCT(--(I35:I39=\"X\"))>0, \"X: De ingevoerde huidige zoutsituatie past niet bij dit KRW type.\", \"\")","v":""},null,null,null,null,null,null,null,null,null,null,null,null,null,null,null,null,1]
[null,null,"N2000 habitattypen",null,null,null,"Huidige zoutsituatie",null,null,null,"Voorjaar",null,"Zomer",null,"Winter",null,null,null,null,1]
[null,null,{"$f":"_xlfn._xlws.FILTER('3. KRW'!C35:C36,'3. KRW'!H35:H36=1,\"Er zijn nog geen habitattypen geselecteerd (zie tabblad 3. KRW).\")","v":"Er zijn nog geen habitattypen geselecteerd (zie tabblad 3. KRW)."},null,null,null,{"$f":"IF(AND(OR('3. KRW'!H35=1,'3. KRW'!H36=1),'3. KRW'!J83<>\"\"),'3. KRW'!J83,\"-\")","v":"-"},null,{"$f":"IF('3. KRW'!K83=\"X\",\"X\",\"\")","v":""},null,{"$f":"IF(AND(G35<>\"-\",G35<>0,$I$30<>\"niet opgegeven\"),IF(OR('3. KRW'!H35=1, '3. KRW'!H36=1),\n   IF(S42=1,\n      IF($I$30>300, \"zeer sterk\", \"geen\"),\n      IF(OR(S42=2, S42=3),\n         IF($I$30<=1000, \"geen\",\n         IF(AND($I$30>1000, $I$30<=10000), \"sterk\",\n         IF($I$30>=10000, \"zeer sterk\", \"geen\"))),\n      IF(S42=4,\n         IF($I$30<=3000, \"geen\",\n         IF($I$30>3000, \"sterk\")),\n      IF(S42=5,\n         IF($I$30<=10000, \"geen\",\n         IF($I$30>10000, \"klein\")),\n      IF(S42=6, \"geen\", \"geen\"))))),\n   \"-\"),\"-\")","v":"-"},null,{"$f":"IF(AND(G35<>\"-\",G35<>0,$I$30<>\"niet opgegeven\"),IF(OR('3. KRW'!H35=1,'3. KRW'!H36=1),IF(S42=1,\n    IF(AND($I$30>300, $I$30<=3000), \"sterk\",\n    IF($I$30>3000, \"zeer sterk\", \"geen\")),\n\n    IF(S42=2,\n        IF(AND($I$30>300, $I$30<=1000), \"geen\",\n        IF($I$30>1000, \"sterk\", \"geen\")),\n\n        IF(S42=3,\n            IF(AND($I$30>300, $I$30<=3000), \"matig\",\n            IF(AND($I$30>3000, $I$30<=10000), \"sterk\",\n            IF($I$30>10000, \"zeer sterk\", \"geen\"))),\n\n            IF(S42=4,\n                IF($I$30<=3000, \"geen\",\n                IF($I$30>3000, \"sterk\")),\n\n                IF(S42=5,\n                    IF($I$30<=10000, \"geen\",\n                    IF($I$30>10000, \"klein\")),\n\n                    IF(S42=6, \"geen\", \"geen\")))))),\"-\"),\"-\")","v":"-"},null,{"$f":"IF(AND(G35<>\"-\",G35<>0,$I$30<>\"niet opgegeven\"),IF(OR('3. KRW'!H35=1,'3. KRW'!H36=1),IF(S42=1,\n    IF(AND($I$30>300, $I$30<=3000), \"matig\",\n    IF($I$30>3000, \"sterk\", \"geen\")),\n\n    IF(S42=2,\n        IF(AND($I$30>300, $I$30<=1000), \"geen\",\n        IF(AND($I$30>1000, $I$30<=3000), \"klein\",\n        IF(AND($I$30>3000, $I$30<=10000), \"matig\",\n        IF($I$30>10000, \"sterk\", \"geen\")))),\n\n        IF(S42=3,\n            IF(AND($I$30>1000, $I$30<=3000), \"geen\",\n            IF(AND($I$30>3000, $I$30<=10000), \"klein\",\n            IF($I$30>10000, \"sterk\", \"klein\"))),\n\n            IF(S42=4,\n                IF($I$30<=3000, \"geen\",\n                IF(AND($I$30>3000, $I$30<=10000), \"klein\",\n                IF($I$30>10000, \"sterk\"))),\n\n                IF(S42=5,\n                    IF($I$30<=10000, \"geen\",\n                    IF($I$30>10000, \"klein\")),\n\n                    IF(S42=6, \"geen\", \"geen\")))))),\"-\"),\"-\")","v":"-"},null,null,null,{"$f":"_xlfn.XLOOKUP(G42,Invoer!$I$34:$I$39,Invoer!$J$34:$J$39)","v":{"$error":"#N/A"}},{"$f":"IF(C42<>\"\",1,0)","v":1},null,{"$f":"IF(G42<>\"\",G42,\"-\")","v":"-"},{"$f":"IF($V42<>\"-\",_xlfn.XLOOKUP(1,(('Grenswaarden KRW'!$B:$B=$V42)*('Grenswaarden KRW'!$C:$C=$K42)),'Grenswaarden KRW'!G:G, \"Nee\"),\"-\")","v":"-"},{"$f":"IF($V42<>\"-\",_xlfn.XLOOKUP(1,(('Grenswaarden KRW'!$B:$B=$V42)*('Grenswaarden KRW'!$C:$C=$K42)),'Grenswaarden KRW'!H:H, \"Nee\"),\"-\")","v":"-"},{"$f":"IF($V42<>\"-\",_xlfn.XLOOKUP(1,(('Grenswaarden KRW'!$B:$B=$V42)*('Grenswaarden KRW'!$C:$C=$K42)),'Grenswaarden KRW'!I:I, \"Nee\"),\"-\")","v":"-"},{"$f":"IF($V42<>\"-\",_xlfn.XLOOKUP(1,(('Grenswaarden KRW'!$B:$B=$V42)*('Grenswaarden KRW'!$C:$C=$K42)),'Grenswaarden KRW'!J:J, \"Nee\"),\"-\")","v":"-"},{"$f":"IF($V42<>\"-\",_xlfn.XLOOKUP(1,(('Grenswaarden KRW'!$B:$B=$V42)*('Grenswaarden KRW'!$C:$C=$K42)),'Grenswaarden KRW'!K:K, \"Nee\"),\"-\")","v":"-"},null,{"$f":"IF($V42<>\"-\",_xlfn.XLOOKUP(1,(('Grenswaarden KRW'!$B:$B=$V42)*('Grenswaarden KRW'!$D:$D=$M42)),'Grenswaarden KRW'!G:G, \"Nee\"),\"-\")","v":"-"},{"$f":"IF($V42<>\"-\",_xlfn.XLOOKUP(1,(('Grenswaarden KRW'!$B:$B=$V42)*('Grenswaarden KRW'!$D:$D=$M42)),'Grenswaarden KRW'!H:H, \"Nee\"),\"-\")","v":"-"},{"$f":"IF($V42<>\"-\",_xlfn.XLOOKUP(1,(('Grenswaarden KRW'!$B:$B=$V42)*('Grenswaarden KRW'!$D:$D=$M42)),'Grenswaarden KRW'!I:I, \"Nee\"),\"-\")","v":"-"},{"$f":"IF($V42<>\"-\",_xlfn.XLOOKUP(1,(('Grenswaarden KRW'!$B:$B=$V42)*('Grenswaarden KRW'!$D:$D=$M42)),'Grenswaarden KRW'!J:J, \"Nee\"),\"-\")","v":"-"},{"$f":"IF($V42<>\"-\",_xlfn.XLOOKUP(1,(('Grenswaarden KRW'!$B:$B=$V42)*('Grenswaarden KRW'!$D:$D=$M42)),'Grenswaarden KRW'!K:K, \"Nee\"),\"-\")","v":"-"},null,{"$f":"IF($V42<>\"-\",_xlfn.XLOOKUP(1,(('Grenswaarden KRW'!$B:$B=$V42)*('Grenswaarden KRW'!$E:$E=$O42)),'Grenswaarden KRW'!G:G, \"Nee\"),\"-\")","v":"-"},{"$f":"IF($V42<>\"-\",_xlfn.XLOOKUP(1,(('Grenswaarden KRW'!$B:$B=$V42)*('Grenswaarden KRW'!$E:$E=$O42)),'Grenswaarden KRW'!H:H, \"Nee\"),\"-\")","v":"-"},{"$f":"IF($V42<>\"-\",_xlfn.XLOOKUP(1,(('Grenswaarden KRW'!$B:$B=$V42)*('Grenswaarden KRW'!$E:$E=$O42)),'Grenswaarden KRW'!I:I, \"Nee\"),\"-\")","v":"-"},{"$f":"IF($V42<>\"-\",_xlfn.XLOOKUP(1,(('Grenswaarden KRW'!$B:$B=$V42)*('Grenswaarden KRW'!$E:$E=$O42)),'Grenswaarden KRW'!J:J, \"Nee\"),\"-\")","v":"-"},{"$f":"IF($V42<>\"-\",_xlfn.XLOOKUP(1,(('Grenswaarden KRW'!$B:$B=$V42)*('Grenswaarden KRW'!$E:$E=$O42)),'Grenswaarden KRW'!K:K, \"Nee\"),\"-\")","v":"-"}]
[null,null,null,null,{"$f":"_xlfn.XLOOKUP(C43,'Grenswaarden Terrestrisch'!$A$40:$A$62,'Grenswaarden Terrestrisch'!$F$40:$F$62,\"\")","v":""},null,{"$f":"IF(AND(C43<>\"\",'3. KRW'!J84<>\"\"),'3. KRW'!J84,\"-\")","v":"-"},null,{"$f":"IF('3. KRW'!K84=\"X\",\"X\",\"\")","v":""},null,{"$f":"IF(AND(G36<>\"-\",G36<>0,$I$30<>\"niet opgegeven\"),IF(OR('3. KRW'!H36=1, '3. KRW'!H37=1),\n   IF(S43=1,\n      IF($I$30>300, \"zeer sterk\", \"geen\"),\n      IF(OR(S43=2, S43=3),\n         IF($I$30<=1000, \"geen\",\n         IF(AND($I$30>1000, $I$30<=10000), \"sterk\",\n         IF($I$30>=10000, \"zeer sterk\", \"geen\"))),\n      IF(S43=4,\n         IF($I$30<=3000, \"geen\",\n         IF($I$30>3000, \"sterk\")),\n      IF(S43=5,\n         IF($I$30<=10000, \"geen\",\n         IF($I$30>10000, \"klein\")),\n      IF(S43=6, \"geen\", \"geen\"))))),\n   \"-\"),\"-\")","v":"-"},null,{"$f":"IF(AND(G36<>\"-\",G36<>0,$I$30<>\"niet opgegeven\"),IF(OR('3. KRW'!H36=1,'3. KRW'!H37=1),IF(S43=1,\n    IF(AND($I$30>300, $I$30<=3000), \"sterk\",\n    IF($I$30>3000, \"zeer sterk\", \"geen\")),\n\n    IF(S43=2,\n        IF(AND($I$30>300, $I$30<=1000), \"geen\",\n        IF($I$30>1000, \"sterk\", \"geen\")),\n\n        IF(S43=3,\n            IF(AND($I$30>300, $I$30<=3000), \"matig\",\n            IF(AND($I$30>3000, $I$30<=10000), \"sterk\",\n            IF($I$30>10000, \"zeer sterk\", \"geen\"))),\n\n            IF(S43=4,\n                IF($I$30<=3000, \"geen\",\n                IF($I$30>3000, \"sterk\")),\n\n                IF(S43=5,\n                    IF($I$30<=10000, \"geen\",\n                    IF($I$30>10000, \"klein\")),\n\n                    IF(S43=6, \"geen\", \"geen\")))))),\"-\"),\"-\")","v":"-"},null,{"$f":"IF(AND(G36<>\"-\",G36<>0,$I$30<>\"niet opgegeven\"),IF(OR('3. KRW'!H36=1,'3. KRW'!H37=1),IF(S43=1,\n    IF(AND($I$30>300, $I$30<=3000), \"matig\",\n    IF($I$30>3000, \"sterk\", \"geen\")),\n\n    IF(S43=2,\n        IF(AND($I$30>300, $I$30<=1000), \"geen\",\n        IF(AND($I$30>1000, $I$30<=3000), \"klein\",\n        IF(AND($I$30>3000, $I$30<=10000), \"matig\",\n        IF($I$30>10000, \"sterk\", \"geen\")))),\n\n        IF(S43=3,\n            IF(AND($I$30>1000, $I$30<=3000), \"geen\",\n            IF(AND($I$30>3000, $I$30<=10000), \"klein\",\n            IF($I$30>10000, \"sterk\", \"klein\"))),\n\n            IF(S43=4,\n                IF($I$30<=3000, \"geen\",\n                IF(AND($I$30>3000, $I$30<=10000), \"klein\",\n                IF($I$30>10000, \"sterk\"))),\n\n                IF(S43=5,\n                    IF($I$30<=10000, \"geen\",\n                    IF($I$30>10000, \"klein\")),\n\n                    IF(S43=6, \"geen\", \"geen\")))))),\"-\"),\"-\")","v":"-"},null,null,null,{"$f":"_xlfn.XLOOKUP(G43,Invoer!$I$34:$I$39,Invoer!$J$34:$J$39)","v":{"$error":"#N/A"}},0,null,"-",{"$f":"IF($V43<>\"-\",_xlfn.XLOOKUP(1,(('Grenswaarden KRW'!$B:$B=$V43)*('Grenswaarden KRW'!$C:$C=$K43)),'Grenswaarden KRW'!G:G, \"Nee\"),\"-\")","v":"-"},{"$f":"IF($V43<>\"-\",_xlfn.XLOOKUP(1,(('Grenswaarden KRW'!$B:$B=$V43)*('Grenswaarden KRW'!$C:$C=$K43)),'Grenswaarden KRW'!H:H, \"Nee\"),\"-\")","v":"-"},{"$f":"IF($V43<>\"-\",_xlfn.XLOOKUP(1,(('Grenswaarden KRW'!$B:$B=$V43)*('Grenswaarden KRW'!$C:$C=$K43)),'Grenswaarden KRW'!I:I, \"Nee\"),\"-\")","v":"-"},{"$f":"IF($V43<>\"-\",_xlfn.XLOOKUP(1,(('Grenswaarden KRW'!$B:$B=$V43)*('Grenswaarden KRW'!$C:$C=$K43)),'Grenswaarden KRW'!J:J, \"Nee\"),\"-\")","v":"-"},{"$f":"IF($V43<>\"-\",_xlfn.XLOOKUP(1,(('Grenswaarden KRW'!$B:$B=$V43)*('Grenswaarden KRW'!$C:$C=$K43)),'Grenswaarden KRW'!K:K, \"Nee\"),\"-\")","v":"-"},null,{"$f":"IF($V43<>\"-\",_xlfn.XLOOKUP(1,(('Grenswaarden KRW'!$B:$B=$V43)*('Grenswaarden KRW'!$D:$D=$M43)),'Grenswaarden KRW'!G:G, \"Nee\"),\"-\")","v":"-"},{"$f":"IF($V43<>\"-\",_xlfn.XLOOKUP(1,(('Grenswaarden KRW'!$B:$B=$V43)*('Grenswaarden KRW'!$D:$D=$M43)),'Grenswaarden KRW'!H:H, \"Nee\"),\"-\")","v":"-"},{"$f":"IF($V43<>\"-\",_xlfn.XLOOKUP(1,(('Grenswaarden KRW'!$B:$B=$V43)*('Grenswaarden KRW'!$D:$D=$M43)),'Grenswaarden KRW'!I:I, \"Nee\"),\"-\")","v":"-"},{"$f":"IF($V43<>\"-\",_xlfn.XLOOKUP(1,(('Grenswaarden KRW'!$B:$B=$V43)*('Grenswaarden KRW'!$D:$D=$M43)),'Grenswaarden KRW'!J:J, \"Nee\"),\"-\")","v":"-"},{"$f":"IF($V43<>\"-\",_xlfn.XLOOKUP(1,(('Grenswaarden KRW'!$B:$B=$V43)*('Grenswaarden KRW'!$D:$D=$M43)),'Grenswaarden KRW'!K:K, \"Nee\"),\"-\")","v":"-"},null,{"$f":"IF($V43<>\"-\",_xlfn.XLOOKUP(1,(('Grenswaarden KRW'!$B:$B=$V43)*('Grenswaarden KRW'!$E:$E=$O43)),'Grenswaarden KRW'!G:G, \"Nee\"),\"-\")","v":"-"},{"$f":"IF($V43<>\"-\",_xlfn.XLOOKUP(1,(('Grenswaarden KRW'!$B:$B=$V43)*('Grenswaarden KRW'!$E:$E=$O43)),'Grenswaarden KRW'!H:H, \"Nee\"),\"-\")","v":"-"},{"$f":"IF($V43<>\"-\",_xlfn.XLOOKUP(1,(('Grenswaarden KRW'!$B:$B=$V43)*('Grenswaarden KRW'!$E:$E=$O43)),'Grenswaarden KRW'!I:I, \"Nee\"),\"-\")","v":"-"},{"$f":"IF($V43<>\"-\",_xlfn.XLOOKUP(1,(('Grenswaarden KRW'!$B:$B=$V43)*('Grenswaarden KRW'!$E:$E=$O43)),'Grenswaarden KRW'!J:J, \"Nee\"),\"-\")","v":"-"},{"$f":"IF($V43<>\"-\",_xlfn.XLOOKUP(1,(('Grenswaarden KRW'!$B:$B=$V43)*('Grenswaarden KRW'!$E:$E=$O43)),'Grenswaarden KRW'!K:K, \"Nee\"),\"-\")","v":"-"}]
[null,null,{"$f":"IF(SUMPRODUCT(--(I42:I43=\"X\"))>0, \"X: De ingevoerde huidige zoutsituatie past niet bij dit N2000 type.\", \"\")","v":""},null,null,null,null,null,null,null,null,null,null,null,null,null,null,null,null,1]
[null,null,null,null,null,null,null,null,null,null,null,null,null,null,null,null,null,null,null,1]
["BLOK 3: BIOTISCHE GEVOELIGHEID\n- TOEKOMSTIGE SITUATIE -",null,null,null,null,null,null,null,null,null,null,null,null,null,null,null,null,null,null,1]
[null,null,"Oordeelsblok 3: biotische gevoeligheid zoutgehalte TOEKOMSTIGE situatie",null,null,null,null,null,null,null,null,"N.B.: De huidige situatie wordt beoordeeld in BLOK 1 & 2.",null,null,null,null,null,null,null,1,null,"Onderbouwing risico inschatting: biotische gevoeligheid zoutgehalte TOEKOMSTIGE situatie"]
[null,null,null,null,null,null,null,null,null,null,null,null,null,null,null,null,null,null,null,1]
[null,null,{"$f":"IF(LEFT(bool_toets_verstoring,2)=\"Ja\",\"In dit blok ziet u de risicobepaling voor de ingevoerde KRW doelen en habitattypen t.g.v. een verstoring of fysieke ingreep op BIOTIEK.\",\"U heeft (nog) niet gekozen om een verstoring of fysieke ingreep te testen. Daarom wordt in dit blok geen beoordeling opgesteld.\")","v":"U heeft (nog) niet gekozen om een verstoring of fysieke ingreep te testen. Daarom wordt in dit blok geen beoordeling opgesteld."},null,null,null,null,null,null,null,null,null,null,null,null,null,null,null,null,1,null,"In dit blok ziet u de verdere onderbouwing van de risicobepaling voor de ingevoerde KRW doelen en habitattypen in de toekomstige situatie op BIOTIEK."]
[null,null,"Om uitvoer te zien, dient u te hebben aangegeven welk(e) KRW doel(en) en/of habitattype(n) u wilt doorlichten, wat de huidige staat van kwaliteit is, wat de eigenschappen zijn van de waterbodem en wat de zoutsituatie is.",null,null,null,null,null,null,null,null,null,null,null,null,null,null,null,null,{"$f":"IF(LEFT(bool_toets_verstoring,2)=\"Ja\",1,0)","v":0},null,"Om uitvoer te zien, dient u te hebben aangegeven welk(e) KRW doel(en) en/of habitattype(n) u wilt doorlichten, wat de huidige staat van kwaliteit is, wat de eigenschappen zijn van de waterbodem en wat de zoutsituatie is."]
[null,null,"Voor het maken van de risicobepaling, wordt het zoutgehalte van het oppervlaktewater vergeleken met de grenswaarden voor verzilting/verzoeting van de ingevoerde KRW doelen en habitattypen. ",null,null,null,null,null,null,null,null,null,null,null,null,null,null,null,null,0]
[null,null,null,null,null,null,null,null,null,null,null,null,null,null,null,null,null,null,null,0]
[null,null,{"$f":"IF(eenheid_zoutgehalte_algemeen<>\"\",_xlfn.CONCAT(\"De eenheid van het toekomstige zoutgehalte die door u is opgegeven, is: \"),\n\"De eenheid van het toekomstige zoutgehalte is onbekend. Risico inschatting niet mogelijk.\")","v":"De eenheid van het toekomstige zoutgehalte is onbekend. Risico inschatting niet mogelijk."},null,{"$f":"IF(eenheid_zoutgehalte_algemeen=\"\",\"onbekend\", eenheid_zoutgehalte_algemeen)","v":"onbekend"},null,null,"Maximaal toekomstig zoutgehalte:",{"$f":"IF(maximaal_zoutgehalte_toekomst=FALSE,\"niet opgegeven\",IF(maximaal_zoutgehalte_toekomst<>0,IF(R30=1,165*maximaal_zoutgehalte_toekomst^1.3438,maximaal_zoutgehalte_toekomst),\"niet opgegeven\"))","v":""},{"$f":"IF(R30=1,\"mg Cl/l\",IF(R30=2,\"mg Cl/l\",\"eenheid onbekend\"))","v":"eenheid onbekend"},null,"N.B.: Onderbouwing risico's staat in het blok rechts.",null,null,null,null,null,null,null,0,null,"Onderstaande tabel geeft weer welke zaken onderliggend zijn aan de risicobepaling in het oordeelsblok 3 (zie links). Deze onderbouwing berust op een deskundigenoordeel (Van Geest Ecologie + B-Ware)."]
[null,null,{"$f":"IF(R30=1,\"De ingevulde EC waardes worden voor de functie aquatische natuur omgerekend naar chloridegehaltes.\",\"\")","v":""},null,null,null,null,null,null,null,null,null,null,null,null,null,null,null,null,0]
[null,null,"Risicobepaling",null,null,null,null,null,null,null,null,null,null,null,null,null,null,null,null,0,null,null,"Voorjaar",null,null,null,null,null,"Zomer",null,null,null,null,null,"Winter"]
[null,null,"Risicobepaling van het huidige maximale zoutgehalte in relatie tot de zoutsituatie.",null,null,null,null,null,null,null,"Risico's t.a.v. verzilting",null,null,null,null,null,null,null,null,0,null,null,{"$f":"'Grenswaarden KRW'!G2","v":"Kwetsbare levensfase"},{"$f":"'Grenswaarden KRW'!H2","v":"Sterfte soorten"},{"$f":"'Grenswaarden KRW'!I2","v":"Oplading waterbodem"},{"$f":"'Grenswaarden KRW'!J2","v":"Afname waterplanten"},{"$f":"'Grenswaarden KRW'!K2","v":"Voedselweb/Daphnia"},null,{"$f":"W56","v":"Kwetsbare levensfase"},{"$f":"X56","v":"Sterfte soorten"},{"$f":"Y56","v":"Oplading waterbodem"},{"$f":"Z56","v":"Afname waterplanten"},{"$f":"AA56","v":"Voedselweb/Daphnia"},null,{"$f":"AC56","v":"Kwetsbare levensfase"},{"$f":"AD56","v":"Sterfte soorten"},{"$f":"AE56","v":"Oplading waterbodem"},{"$f":"AF56","v":"Afname waterplanten"},{"$f":"AG56","v":"Voedselweb/Daphnia"}]
[null,null,"KRW-doeltypen",null,null,null,"Huidige zoutsituatie",null,null,null,"Voorjaar",null,"Zomer",null,"Winter",null,null,null,null,0]
[null,null,{"$f":"_xlfn._xlws.FILTER('3. KRW'!C12:C31,'3. KRW'!H12:H31=1,\"Er zijn nog geen KRW doeltypen geselecteerd (zie tabblad 3. KRW).\")","v":"Er zijn nog geen KRW doeltypen geselecteerd (zie tabblad 3. KRW)."},null,null,null,{"$f":"IF(AND(C58<>\"\",R58=1,'3. KRW'!J77<>\"\"),'3. KRW'!J77,\"-\")","v":"-"},null,{"$f":"I35","v":""},null,{"$f":"IF(AND(G58<>\"-\",G58<>0,$I$53<>\"niet opgegeven\"),IF(S58=1, IF($I$53>300, \"zeer sterk\", \"geen\"),\n   IF(OR(S58=2, S58=3),\n      IF($I$53<=1000, \"geen\",\n      IF(AND($I$53>1000, $I$53<=10000), \"sterk\",\n      IF($I$53>10000, \"zeer sterk\", \"geen\"))),\n   IF(S58=4,\n      IF($I$53<=3000, \"geen\",\n      IF($I$53>3000, \"sterk\")),\n   IF(S58=5,\n      IF($I$53<=10000, \"geen\",\n      IF($I$53>10000, \"klein\")),\n   IF(S58=6, \"geen\", \"geen\"))))),\"-\")","v":"-"},null,{"$f":"IF(AND(G58<>\"-\",G58<>0,$I$53<>\"niet opgegeven\"),IF(S58=1,\n    IF(AND($I$53>300, $I$53<=3000), \"sterk\",\n    IF($I$53>3000, \"zeer sterk\", \"geen\")),\n\n    IF(S58=2,\n        IF(AND($I$53>300, $I$53<=1000), \"geen\",\n        IF($I$53>1000, \"sterk\", \"geen\")),\n\n        IF(S58=3,\n            IF(AND($I$53>300, $I$53<=3000), \"matig\",\n            IF(AND($I$53>3000, $I$53<=10000), \"sterk\",\n            IF($I$53>10000, \"zeer sterk\", \"geen\"))),\n\n            IF(S58=4,\n                IF($I$53<=3000, \"geen\",\n                IF($I$53>3000, \"sterk\")),\n\n                IF(S58=5,\n                    IF($I$53<=10000, \"geen\",\n                    IF($I$53>10000, \"klein\")),\n\n                    IF(S58=6, \"geen\", \"geen\")))))),\"-\")","v":"-"},null,{"$f":"IF(AND(G58<>\"-\",G58<>0,$I$53<>\"niet opgegeven\"),IF(S58=1,\n    IF(AND($I$53>300, $I$53<=3000), \"matig\",\n    IF($I$53>3000, \"sterk\", \"geen\")),\n\n    IF(S58=2,\n        IF(AND($I$53>300, $I$53<=1000), \"geen\",\n        IF(AND($I$53>1000, $I$53<=3000), \"klein\",\n        IF(AND($I$53>3000, $I$53<=10000), \"matig\",\n        IF($I$53>10000, \"sterk\", \"geen\")))),\n\n        IF(S58=3,\n            IF(AND($I$53>1000, $I$53<=3000), \"geen\",\n            IF(AND($I$53>3000, $I$53<=10000), \"klein\",\n            IF($I$53>10000, \"sterk\", \"klein\"))),\n\n            IF(S58=4,\n                IF($I$53<=3000, \"geen\",\n                IF(AND($I$53>3000, $I$53<=10000), \"klein\",\n                IF($I$53>10000, \"sterk\"))),\n\n                IF(S58=5,\n                    IF($I$53<=10000, \"geen\",\n                    IF($I$53>10000, \"klein\")),\n\n                    IF(S58=6, \"geen\", \"geen\")))))),\"-\")","v":"-"},null,null,{"$f":"IF(LEFT(C35,1)=\"E\",0,1)","v":0},{"$f":"IF($I$53=\"niet opgegeven\",0,_xlfn.XLOOKUP(G58,Invoer!$I$34:$I$39,Invoer!$J$34:$J$39))","v":{"$error":"#N/A"}},{"$f":"IF(AND(C58<>\"\",LEFT(bool_toets_verstoring,2)=\"Ja\"),1,0)","v":0},null,{"$f":"IF(G58<>\"\",G58,\"-\")","v":"-"},{"$f":"IF($V58<>\"-\",_xlfn.XLOOKUP(1,(('Grenswaarden KRW'!$B:$B=$V58)*('Grenswaarden KRW'!$C:$C=$K58)),'Grenswaarden KRW'!G:G, \"Nee\"),\"-\")","v":"-"},{"$f":"IF($V58<>\"-\",_xlfn.XLOOKUP(1,(('Grenswaarden KRW'!$B:$B=$V58)*('Grenswaarden KRW'!$C:$C=$K58)),'Grenswaarden KRW'!H:H, \"Nee\"),\"-\")","v":"-"},{"$f":"IF($V58<>\"-\",_xlfn.XLOOKUP(1,(('Grenswaarden KRW'!$B:$B=$V58)*('Grenswaarden KRW'!$C:$C=$K58)),'Grenswaarden KRW'!I:I, \"Nee\"),\"-\")","v":"-"},{"$f":"IF($V58<>\"-\",_xlfn.XLOOKUP(1,(('Grenswaarden KRW'!$B:$B=$V58)*('Grenswaarden KRW'!$C:$C=$K58)),'Grenswaarden KRW'!J:J, \"Nee\"),\"-\")","v":"-"},{"$f":"IF($V58<>\"-\",_xlfn.XLOOKUP(1,(('Grenswaarden KRW'!$B:$B=$V58)*('Grenswaarden KRW'!$C:$C=$K58)),'Grenswaarden KRW'!K:K, \"Nee\"),\"-\")","v":"-"},null,{"$f":"IF($V58<>\"-\",_xlfn.XLOOKUP(1,(('Grenswaarden KRW'!$B:$B=$V58)*('Grenswaarden KRW'!$D:$D=$M58)),'Grenswaarden KRW'!G:G, \"Nee\"),\"-\")","v":"-"},{"$f":"IF($V58<>\"-\",_xlfn.XLOOKUP(1,(('Grenswaarden KRW'!$B:$B=$V58)*('Grenswaarden KRW'!$D:$D=$M58)),'Grenswaarden KRW'!H:H, \"Nee\"),\"-\")","v":"-"},{"$f":"IF($V58<>\"-\",_xlfn.XLOOKUP(1,(('Grenswaarden KRW'!$B:$B=$V58)*('Grenswaarden KRW'!$D:$D=$M58)),'Grenswaarden KRW'!I:I, \"Nee\"),\"-\")","v":"-"},{"$f":"IF($V58<>\"-\",_xlfn.XLOOKUP(1,(('Grenswaarden KRW'!$B:$B=$V58)*('Grenswaarden KRW'!$D:$D=$M58)),'Grenswaarden KRW'!J:J, \"Nee\"),\"-\")","v":"-"},{"$f":"IF($V58<>\"-\",_xlfn.XLOOKUP(1,(('Grenswaarden KRW'!$B:$B=$V58)*('Grenswaarden KRW'!$D:$D=$M58)),'Grenswaarden KRW'!K:K, \"Nee\"),\"-\")","v":"-"},null,{"$f":"IF($V58<>\"-\",_xlfn.XLOOKUP(1,(('Grenswaarden KRW'!$B:$B=$V58)*('Grenswaarden KRW'!$E:$E=$O58)),'Grenswaarden KRW'!G:G, \"Nee\"),\"-\")","v":"-"},{"$f":"IF($V58<>\"-\",_xlfn.XLOOKUP(1,(('Grenswaarden KRW'!$B:$B=$V58)*('Grenswaarden KRW'!$E:$E=$O58)),'Grenswaarden KRW'!H:H, \"Nee\"),\"-\")","v":"-"},{"$f":"IF($V58<>\"-\",_xlfn.XLOOKUP(1,(('Grenswaarden KRW'!$B:$B=$V58)*('Grenswaarden KRW'!$E:$E=$O58)),'Grenswaarden KRW'!I:I, \"Nee\"),\"-\")","v":"-"},{"$f":"IF($V58<>\"-\",_xlfn.XLOOKUP(1,(('Grenswaarden KRW'!$B:$B=$V58)*('Grenswaarden KRW'!$E:$E=$O58)),'Grenswaarden KRW'!J:J, \"Nee\"),\"-\")","v":"-"},{"$f":"IF($V58<>\"-\",_xlfn.XLOOKUP(1,(('Grenswaarden KRW'!$B:$B=$V58)*('Grenswaarden KRW'!$E:$E=$O58)),'Grenswaarden KRW'!K:K, \"Nee\"),\"-\")","v":"-"}]
[null,null,null,null,null,null,{"$f":"IF(AND(C59<>\"\",R59=1,'3. KRW'!J78<>\"\"),'3. KRW'!J78,\"-\")","v":"-"},null,{"$f":"I36","v":""},null,{"$f":"IF(AND(G59<>\"-\",G59<>0,$I$53<>\"niet opgegeven\"),IF(S59=1, IF($I$53>300, \"zeer sterk\", \"geen\"),\n   IF(OR(S59=2, S59=3),\n      IF($I$53<=1000, \"geen\",\n      IF(AND($I$53>1000, $I$53<=10000), \"sterk\",\n      IF($I$53>10000, \"zeer sterk\", \"geen\"))),\n   IF(S59=4,\n      IF($I$53<=3000, \"geen\",\n      IF($I$53>3000, \"sterk\")),\n   IF(S59=5,\n      IF($I$53<=10000, \"geen\",\n      IF($I$53>10000, \"klein\")),\n   IF(S59=6, \"geen\", \"geen\"))))),\"-\")","v":"-"},null,{"$f":"IF(AND(G59<>\"-\",G59<>0,$I$53<>\"niet opgegeven\"),IF(S59=1,\n    IF(AND($I$53>300, $I$53<=3000), \"sterk\",\n    IF($I$53>3000, \"zeer sterk\", \"geen\")),\n\n    IF(S59=2,\n        IF(AND($I$53>300, $I$53<=1000), \"geen\",\n        IF($I$53>1000, \"sterk\", \"geen\")),\n\n        IF(S59=3,\n            IF(AND($I$53>300, $I$53<=3000), \"matig\",\n            IF(AND($I$53>3000, $I$53<=10000), \"sterk\",\n            IF($I$53>10000, \"zeer sterk\", \"geen\"))),\n\n            IF(S59=4,\n                IF($I$53<=3000, \"geen\",\n                IF($I$53>3000, \"sterk\")),\n\n                IF(S59=5,\n                    IF($I$53<=10000, \"geen\",\n                    IF($I$53>10000, \"klein\")),\n\n                    IF(S59=6, \"geen\", \"geen\")))))),\"-\")","v":"-"},null,{"$f":"IF(AND(G59<>\"-\",G59<>0,$I$53<>\"niet opgegeven\"),IF(S59=1,\n    IF(AND($I$53>300, $I$53<=3000), \"matig\",\n    IF($I$53>3000, \"sterk\", \"geen\")),\n\n    IF(S59=2,\n        IF(AND($I$53>300, $I$53<=1000), \"geen\",\n        IF(AND($I$53>1000, $I$53<=3000), \"klein\",\n        IF(AND($I$53>3000, $I$53<=10000), \"matig\",\n        IF($I$53>10000, \"sterk\", \"geen\")))),\n\n        IF(S59=3,\n            IF(AND($I$53>1000, $I$53<=3000), \"geen\",\n            IF(AND($I$53>3000, $I$53<=10000), \"klein\",\n            IF($I$53>10000, \"sterk\", \"klein\"))),\n\n            IF(S59=4,\n                IF($I$53<=3000, \"geen\",\n                IF(AND($I$53>3000, $I$53<=10000), \"klein\",\n                IF($I$53>10000, \"sterk\"))),\n\n                IF(S59=5,\n                    IF($I$53<=10000, \"geen\",\n                    IF($I$53>10000, \"klein\")),\n\n                    IF(S59=6, \"geen\", \"geen\")))))),\"-\")","v":"-"},null,null,{"$f":"IF(C59<>\"\",1,0)","v":0},{"$f":"IF($I$53=\"niet opgegeven\",0,_xlfn.XLOOKUP(G59,Invoer!$I$34:$I$39,Invoer!$J$34:$J$39))","v":{"$error":"#N/A"}},{"$f":"IF(AND(C59<>\"\",LEFT(bool_toets_verstoring,2)=\"Ja\"),1,0)","v":0},null,"-",{"$f":"IF($V59<>\"-\",_xlfn.XLOOKUP(1,(('Grenswaarden KRW'!$B:$B=$V59)*('Grenswaarden KRW'!$C:$C=$K59)),'Grenswaarden KRW'!G:G, \"Nee\"),\"-\")","v":"-"},{"$f":"IF($V59<>\"-\",_xlfn.XLOOKUP(1,(('Grenswaarden KRW'!$B:$B=$V59)*('Grenswaarden KRW'!$C:$C=$K59)),'Grenswaarden KRW'!H:H, \"Nee\"),\"-\")","v":"-"},{"$f":"IF($V59<>\"-\",_xlfn.XLOOKUP(1,(('Grenswaarden KRW'!$B:$B=$V59)*('Grenswaarden KRW'!$C:$C=$K59)),'Grenswaarden KRW'!I:I, \"Nee\"),\"-\")","v":"-"},{"$f":"IF($V59<>\"-\",_xlfn.XLOOKUP(1,(('Grenswaarden KRW'!$B:$B=$V59)*('Grenswaarden KRW'!$C:$C=$K59)),'Grenswaarden KRW'!J:J, \"Nee\"),\"-\")","v":"-"},{"$f":"IF($V59<>\"-\",_xlfn.XLOOKUP(1,(('Grenswaarden KRW'!$B:$B=$V59)*('Grenswaarden KRW'!$C:$C=$K59)),'Grenswaarden KRW'!K:K, \"Nee\"),\"-\")","v":"-"},null,{"$f":"IF($V59<>\"-\",_xlfn.XLOOKUP(1,(('Grenswaarden KRW'!$B:$B=$V59)*('Grenswaarden KRW'!$D:$D=$M59)),'Grenswaarden KRW'!G:G, \"Nee\"),\"-\")","v":"-"},{"$f":"IF($V59<>\"-\",_xlfn.XLOOKUP(1,(('Grenswaarden KRW'!$B:$B=$V59)*('Grenswaarden KRW'!$D:$D=$M59)),'Grenswaarden KRW'!H:H, \"Nee\"),\"-\")","v":"-"},{"$f":"IF($V59<>\"-\",_xlfn.XLOOKUP(1,(('Grenswaarden KRW'!$B:$B=$V59)*('Grenswaarden KRW'!$D:$D=$M59)),'Grenswaarden KRW'!I:I, \"Nee\"),\"-\")","v":"-"},{"$f":"IF($V59<>\"-\",_xlfn.XLOOKUP(1,(('Grenswaarden KRW'!$B:$B=$V59)*('Grenswaarden KRW'!$D:$D=$M59)),'Grenswaarden KRW'!J:J, \"Nee\"),\"-\")","v":"-"},{"$f":"IF($V59<>\"-\",_xlfn.XLOOKUP(1,(('Grenswaarden KRW'!$B:$B=$V59)*('Grenswaarden KRW'!$D:$D=$M59)),'Grenswaarden KRW'!K:K, \"Nee\"),\"-\")","v":"-"},null,{"$f":"IF($V59<>\"-\",_xlfn.XLOOKUP(1,(('Grenswaarden KRW'!$B:$B=$V59)*('Grenswaarden KRW'!$E:$E=$O59)),'Grenswaarden KRW'!G:G, \"Nee\"),\"-\")","v":"-"},{"$f":"IF($V59<>\"-\",_xlfn.XLOOKUP(1,(('Grenswaarden KRW'!$B:$B=$V59)*('Grenswaarden KRW'!$E:$E=$O59)),'Grenswaarden KRW'!H:H, \"Nee\"),\"-\")","v":"-"},{"$f":"IF($V59<>\"-\",_xlfn.XLOOKUP(1,(('Grenswaarden KRW'!$B:$B=$V59)*('Grenswaarden KRW'!$E:$E=$O59)),'Grenswaarden KRW'!I:I, \"Nee\"),\"-\")","v":"-"},{"$f":"IF($V59<>\"-\",_xlfn.XLOOKUP(1,(('Grenswaarden KRW'!$B:$B=$V59)*('Grenswaarden KRW'!$E:$E=$O59)),'Grenswaarden KRW'!J:J, \"Nee\"),\"-\")","v":"-"},{"$f":"IF($V59<>\"-\",_xlfn.XLOOKUP(1,(('Grenswaarden KRW'!$B:$B=$V59)*('Grenswaarden KRW'!$E:$E=$O59)),'Grenswaarden KRW'!K:K, \"Nee\"),\"-\")","v":"-"}]
[null,null,null,null,null,null,{"$f":"IF(AND(C60<>\"\",R60=1,'3. KRW'!J79<>\"\"),'3. KRW'!J79,\"-\")","v":"-"},null,"",null,"-",null,"-",null,"-",null,null,{"$f":"IF(C60<>\"\",1,0)","v":0},{"$f":"IF($I$53=\"niet opgegeven\",0,_xlfn.XLOOKUP(G60,Invoer!$I$34:$I$39,Invoer!$J$34:$J$39))","v":{"$error":"#N/A"}},{"$f":"IF(AND(C60<>\"\",LEFT(bool_toets_verstoring,2)=\"Ja\"),1,0)","v":0},null,"-",{"$f":"IF($V60<>\"-\",_xlfn.XLOOKUP(1,(('Grenswaarden KRW'!$B:$B=$V60)*('Grenswaarden KRW'!$C:$C=$K60)),'Grenswaarden KRW'!G:G, \"Nee\"),\"-\")","v":"-"},{"$f":"IF($V60<>\"-\",_xlfn.XLOOKUP(1,(('Grenswaarden KRW'!$B:$B=$V60)*('Grenswaarden KRW'!$C:$C=$K60)),'Grenswaarden KRW'!H:H, \"Nee\"),\"-\")","v":"-"},{"$f":"IF($V60<>\"-\",_xlfn.XLOOKUP(1,(('Grenswaarden KRW'!$B:$B=$V60)*('Grenswaarden KRW'!$C:$C=$K60)),'Grenswaarden KRW'!I:I, \"Nee\"),\"-\")","v":"-"},{"$f":"IF($V60<>\"-\",_xlfn.XLOOKUP(1,(('Grenswaarden KRW'!$B:$B=$V60)*('Grenswaarden KRW'!$C:$C=$K60)),'Grenswaarden KRW'!J:J, \"Nee\"),\"-\")","v":"-"},{"$f":"IF($V60<>\"-\",_xlfn.XLOOKUP(1,(('Grenswaarden KRW'!$B:$B=$V60)*('Grenswaarden KRW'!$C:$C=$K60)),'Grenswaarden KRW'!K:K, \"Nee\"),\"-\")","v":"-"},null,{"$f":"IF($V60<>\"-\",_xlfn.XLOOKUP(1,(('Grenswaarden KRW'!$B:$B=$V60)*('Grenswaarden KRW'!$D:$D=$M60)),'Grenswaarden KRW'!G:G, \"Nee\"),\"-\")","v":"-"},{"$f":"IF($V60<>\"-\",_xlfn.XLOOKUP(1,(('Grenswaarden KRW'!$B:$B=$V60)*('Grenswaarden KRW'!$D:$D=$M60)),'Grenswaarden KRW'!H:H, \"Nee\"),\"-\")","v":"-"},{"$f":"IF($V60<>\"-\",_xlfn.XLOOKUP(1,(('Grenswaarden KRW'!$B:$B=$V60)*('Grenswaarden KRW'!$D:$D=$M60)),'Grenswaarden KRW'!I:I, \"Nee\"),\"-\")","v":"-"},{"$f":"IF($V60<>\"-\",_xlfn.XLOOKUP(1,(('Grenswaarden KRW'!$B:$B=$V60)*('Grenswaarden KRW'!$D:$D=$M60)),'Grenswaarden KRW'!J:J, \"Nee\"),\"-\")","v":"-"},{"$f":"IF($V60<>\"-\",_xlfn.XLOOKUP(1,(('Grenswaarden KRW'!$B:$B=$V60)*('Grenswaarden KRW'!$D:$D=$M60)),'Grenswaarden KRW'!K:K, \"Nee\"),\"-\")","v":"-"},null,{"$f":"IF($V60<>\"-\",_xlfn.XLOOKUP(1,(('Grenswaarden KRW'!$B:$B=$V60)*('Grenswaarden KRW'!$E:$E=$O60)),'Grenswaarden KRW'!G:G, \"Nee\"),\"-\")","v":"-"},{"$f":"IF($V60<>\"-\",_xlfn.XLOOKUP(1,(('Grenswaarden KRW'!$B:$B=$V60)*('Grenswaarden KRW'!$E:$E=$O60)),'Grenswaarden KRW'!H:H, \"Nee\"),\"-\")","v":"-"},{"$f":"IF($V60<>\"-\",_xlfn.XLOOKUP(1,(('Grenswaarden KRW'!$B:$B=$V60)*('Grenswaarden KRW'!$E:$E=$O60)),'Grenswaarden KRW'!I:I, \"Nee\"),\"-\")","v":"-"},{"$f":"IF($V60<>\"-\",_xlfn.XLOOKUP(1,(('Grenswaarden KRW'!$B:$B=$V60)*('Grenswaarden KRW'!$E:$E=$O60)),'Grenswaarden KRW'!J:J, \"Nee\"),\"-\")","v":"-"},{"$f":"IF($V60<>\"-\",_xlfn.XLOOKUP(1,(('Grenswaarden KRW'!$B:$B=$V60)*('Grenswaarden KRW'!$E:$E=$O60)),'Grenswaarden KRW'!K:K, \"Nee\"),\"-\")","v":"-"}]
[null,null,null,null,null,null,{"$f":"IF(AND(C61<>\"\",R61=1,'3. KRW'!J80<>\"\"),'3. KRW'!J80,\"-\")","v":"-"},null,"",null,"-",null,"-",null,"-",null,null,{"$f":"IF(C61<>\"\",1,0)","v":0},{"$f":"IF($I$53=\"niet opgegeven\",0,_xlfn.XLOOKUP(G61,Invoer!$I$34:$I$39,Invoer!$J$34:$J$39))","v":{"$error":"#N/A"}},{"$f":"IF(AND(C61<>\"\",LEFT(bool_toets_verstoring,2)=\"Ja\"),1,0)","v":0},null,"-",{"$f":"IF($V61<>\"-\",_xlfn.XLOOKUP(1,(('Grenswaarden KRW'!$B:$B=$V61)*('Grenswaarden KRW'!$C:$C=$K61)),'Grenswaarden KRW'!G:G, \"Nee\"),\"-\")","v":"-"},{"$f":"IF($V61<>\"-\",_xlfn.XLOOKUP(1,(('Grenswaarden KRW'!$B:$B=$V61)*('Grenswaarden KRW'!$C:$C=$K61)),'Grenswaarden KRW'!H:H, \"Nee\"),\"-\")","v":"-"},{"$f":"IF($V61<>\"-\",_xlfn.XLOOKUP(1,(('Grenswaarden KRW'!$B:$B=$V61)*('Grenswaarden KRW'!$C:$C=$K61)),'Grenswaarden KRW'!I:I, \"Nee\"),\"-\")","v":"-"},{"$f":"IF($V61<>\"-\",_xlfn.XLOOKUP(1,(('Grenswaarden KRW'!$B:$B=$V61)*('Grenswaarden KRW'!$C:$C=$K61)),'Grenswaarden KRW'!J:J, \"Nee\"),\"-\")","v":"-"},{"$f":"IF($V61<>\"-\",_xlfn.XLOOKUP(1,(('Grenswaarden KRW'!$B:$B=$V61)*('Grenswaarden KRW'!$C:$C=$K61)),'Grenswaarden KRW'!K:K, \"Nee\"),\"-\")","v":"-"},null,{"$f":"IF($V61<>\"-\",_xlfn.XLOOKUP(1,(('Grenswaarden KRW'!$B:$B=$V61)*('Grenswaarden KRW'!$D:$D=$M61)),'Grenswaarden KRW'!G:G, \"Nee\"),\"-\")","v":"-"},{"$f":"IF($V61<>\"-\",_xlfn.XLOOKUP(1,(('Grenswaarden KRW'!$B:$B=$V61)*('Grenswaarden KRW'!$D:$D=$M61)),'Grenswaarden KRW'!H:H, \"Nee\"),\"-\")","v":"-"},{"$f":"IF($V61<>\"-\",_xlfn.XLOOKUP(1,(('Grenswaarden KRW'!$B:$B=$V61)*('Grenswaarden KRW'!$D:$D=$M61)),'Grenswaarden KRW'!I:I, \"Nee\"),\"-\")","v":"-"},{"$f":"IF($V61<>\"-\",_xlfn.XLOOKUP(1,(('Grenswaarden KRW'!$B:$B=$V61)*('Grenswaarden KRW'!$D:$D=$M61)),'Grenswaarden KRW'!J:J, \"Nee\"),\"-\")","v":"-"},{"$f":"IF($V61<>\"-\",_xlfn.XLOOKUP(1,(('Grenswaarden KRW'!$B:$B=$V61)*('Grenswaarden KRW'!$D:$D=$M61)),'Grenswaarden KRW'!K:K, \"Nee\"),\"-\")","v":"-"},null,{"$f":"IF($V61<>\"-\",_xlfn.XLOOKUP(1,(('Grenswaarden KRW'!$B:$B=$V61)*('Grenswaarden KRW'!$E:$E=$O61)),'Grenswaarden KRW'!G:G, \"Nee\"),\"-\")","v":"-"},{"$f":"IF($V61<>\"-\",_xlfn.XLOOKUP(1,(('Grenswaarden KRW'!$B:$B=$V61)*('Grenswaarden KRW'!$E:$E=$O61)),'Grenswaarden KRW'!H:H, \"Nee\"),\"-\")","v":"-"},{"$f":"IF($V61<>\"-\",_xlfn.XLOOKUP(1,(('Grenswaarden KRW'!$B:$B=$V61)*('Grenswaarden KRW'!$E:$E=$O61)),'Grenswaarden KRW'!I:I, \"Nee\"),\"-\")","v":"-"},{"$f":"IF($V61<>\"-\",_xlfn.XLOOKUP(1,(('Grenswaarden KRW'!$B:$B=$V61)*('Grenswaarden KRW'!$E:$E=$O61)),'Grenswaarden KRW'!J:J, \"Nee\"),\"-\")","v":"-"},{"$f":"IF($V61<>\"-\",_xlfn.XLOOKUP(1,(('Grenswaarden KRW'!$B:$B=$V61)*('Grenswaarden KRW'!$E:$E=$O61)),'Grenswaarden KRW'!K:K, \"Nee\"),\"-\")","v":"-"}]
[null,null,null,null,null,null,{"$f":"IF(AND(C62<>\"\",R62=1,'3. KRW'!J81<>\"\"),'3. KRW'!J81,\"-\")","v":"-"},null,"",null,"-",null,"-",null,"-",null,null,{"$f":"IF(C62<>\"\",1,0)","v":0},{"$f":"IF($I$53=\"niet opgegeven\",0,_xlfn.XLOOKUP(G62,Invoer!$I$34:$I$39,Invoer!$J$34:$J$39))","v":{"$error":"#N/A"}},{"$f":"IF(AND(C62<>\"\",LEFT(bool_toets_verstoring,2)=\"Ja\"),1,0)","v":0},null,"-",{"$f":"IF($V62<>\"-\",_xlfn.XLOOKUP(1,(('Grenswaarden KRW'!$B:$B=$V62)*('Grenswaarden KRW'!$C:$C=$K62)),'Grenswaarden KRW'!G:G, \"Nee\"),\"-\")","v":"-"},{"$f":"IF($V62<>\"-\",_xlfn.XLOOKUP(1,(('Grenswaarden KRW'!$B:$B=$V62)*('Grenswaarden KRW'!$C:$C=$K62)),'Grenswaarden KRW'!H:H, \"Nee\"),\"-\")","v":"-"},{"$f":"IF($V62<>\"-\",_xlfn.XLOOKUP(1,(('Grenswaarden KRW'!$B:$B=$V62)*('Grenswaarden KRW'!$C:$C=$K62)),'Grenswaarden KRW'!I:I, \"Nee\"),\"-\")","v":"-"},{"$f":"IF($V62<>\"-\",_xlfn.XLOOKUP(1,(('Grenswaarden KRW'!$B:$B=$V62)*('Grenswaarden KRW'!$C:$C=$K62)),'Grenswaarden KRW'!J:J, \"Nee\"),\"-\")","v":"-"},{"$f":"IF($V62<>\"-\",_xlfn.XLOOKUP(1,(('Grenswaarden KRW'!$B:$B=$V62)*('Grenswaarden KRW'!$C:$C=$K62)),'Grenswaarden KRW'!K:K, \"Nee\"),\"-\")","v":"-"},null,{"$f":"IF($V62<>\"-\",_xlfn.XLOOKUP(1,(('Grenswaarden KRW'!$B:$B=$V62)*('Grenswaarden KRW'!$D:$D=$M62)),'Grenswaarden KRW'!G:G, \"Nee\"),\"-\")","v":"-"},{"$f":"IF($V62<>\"-\",_xlfn.XLOOKUP(1,(('Grenswaarden KRW'!$B:$B=$V62)*('Grenswaarden KRW'!$D:$D=$M62)),'Grenswaarden KRW'!H:H, \"Nee\"),\"-\")","v":"-"},{"$f":"IF($V62<>\"-\",_xlfn.XLOOKUP(1,(('Grenswaarden KRW'!$B:$B=$V62)*('Grenswaarden KRW'!$D:$D=$M62)),'Grenswaarden KRW'!I:I, \"Nee\"),\"-\")","v":"-"},{"$f":"IF($V62<>\"-\",_xlfn.XLOOKUP(1,(('Grenswaarden KRW'!$B:$B=$V62)*('Grenswaarden KRW'!$D:$D=$M62)),'Grenswaarden KRW'!J:J, \"Nee\"),\"-\")","v":"-"},{"$f":"IF($V62<>\"-\",_xlfn.XLOOKUP(1,(('Grenswaarden KRW'!$B:$B=$V62)*('Grenswaarden KRW'!$D:$D=$M62)),'Grenswaarden KRW'!K:K, \"Nee\"),\"-\")","v":"-"},null,{"$f":"IF($V62<>\"-\",_xlfn.XLOOKUP(1,(('Grenswaarden KRW'!$B:$B=$V62)*('Grenswaarden KRW'!$E:$E=$O62)),'Grenswaarden KRW'!G:G, \"Nee\"),\"-\")","v":"-"},{"$f":"IF($V62<>\"-\",_xlfn.XLOOKUP(1,(('Grenswaarden KRW'!$B:$B=$V62)*('Grenswaarden KRW'!$E:$E=$O62)),'Grenswaarden KRW'!H:H, \"Nee\"),\"-\")","v":"-"},{"$f":"IF($V62<>\"-\",_xlfn.XLOOKUP(1,(('Grenswaarden KRW'!$B:$B=$V62)*('Grenswaarden KRW'!$E:$E=$O62)),'Grenswaarden KRW'!I:I, \"Nee\"),\"-\")","v":"-"},{"$f":"IF($V62<>\"-\",_xlfn.XLOOKUP(1,(('Grenswaarden KRW'!$B:$B=$V62)*('Grenswaarden KRW'!$E:$E=$O62)),'Grenswaarden KRW'!J:J, \"Nee\"),\"-\")","v":"-"},{"$f":"IF($V62<>\"-\",_xlfn.XLOOKUP(1,(('Grenswaarden KRW'!$B:$B=$V62)*('Grenswaarden KRW'!$E:$E=$O62)),'Grenswaarden KRW'!K:K, \"Nee\"),\"-\")","v":"-"}]
[null,null,{"$f":"C40","v":""},null,null,null,null,null,null,null,null,null,null,null,null,null,null,null,null,{"$f":"IF(LEFT(bool_toets_verstoring,2)=\"Ja\",1,0)","v":0}]
[null,null,"N2000 habitattypen",null,null,null,"Huidige zoutsituatie",null,null,null,"Voorjaar",null,"Zomer",null,"Winter",null,null,null,null,{"$f":"IF(LEFT(bool_toets_verstoring,2)=\"Ja\",1,0)","v":0}]
[null,null,{"$f":"_xlfn._xlws.FILTER('3. KRW'!C35:C36,'3. KRW'!H35:H36=1,\"Er zijn nog geen habitattypen geselecteerd (zie tabblad 3. KRW).\")","v":"Er zijn nog geen habitattypen geselecteerd (zie tabblad 3. KRW)."},null,null,null,{"$f":"IF(AND(OR('3. KRW'!H35=1,'3. KRW'!H36=1),'3. KRW'!J83<>\"\"),'3. KRW'!J83,\"-\")","v":"-"},null,"",null,{"$f":"IF(AND(G65<>\"-\",G65<>0,$I$53<>\"niet opgegeven\"),IF(S65=1, IF($I$53>300, \"zeer sterk\", \"geen\"),\n   IF(OR(S65=2, S65=3),\n      IF($I$53<=1000, \"geen\",\n      IF(AND($I$53>1000, $I$53<=10000), \"sterk\",\n      IF($I$53>10000, \"zeer sterk\", \"geen\"))),\n   IF(S65=4,\n      IF($I$53<=3000, \"geen\",\n      IF($I$53>3000, \"sterk\")),\n   IF(S65=5,\n      IF($I$53<=10000, \"geen\",\n      IF($I$53>10000, \"klein\")),\n   IF(S65=6, \"geen\", \"geen\"))))),\"-\")","v":"-"},null,{"$f":"IF(AND(G65<>\"-\",G65<>0,$I$53<>\"niet opgegeven\"),IF(S65=1,\n    IF(AND($I$53>300, $I$53<=3000), \"sterk\",\n    IF($I$53>3000, \"zeer sterk\", \"geen\")),\n\n    IF(S65=2,\n        IF(AND($I$53>300, $I$53<=1000), \"geen\",\n        IF($I$53>1000, \"sterk\", \"geen\")),\n\n        IF(S65=3,\n            IF(AND($I$53>300, $I$53<=3000), \"matig\",\n            IF(AND($I$53>3000, $I$53<=10000), \"sterk\",\n            IF($I$53>10000, \"zeer sterk\", \"geen\"))),\n\n            IF(S65=4,\n                IF($I$53<=3000, \"geen\",\n                IF($I$53>3000, \"sterk\")),\n\n                IF(S65=5,\n                    IF($I$53<=10000, \"geen\",\n                    IF($I$53>10000, \"klein\")),\n\n                    IF(S65=6, \"geen\", \"geen\")))))),\"-\")","v":"-"},null,{"$f":"IF(AND(G65<>\"-\",G65<>0,$I$53<>\"niet opgegeven\"),IF(S65=1,\n    IF(AND($I$53>300, $I$53<=3000), \"matig\",\n    IF($I$53>3000, \"sterk\", \"geen\")),\n\n    IF(S65=2,\n        IF(AND($I$53>300, $I$53<=1000), \"geen\",\n        IF(AND($I$53>1000, $I$53<=3000), \"klein\",\n        IF(AND($I$53>3000, $I$53<=10000), \"matig\",\n        IF($I$53>10000, \"sterk\", \"geen\")))),\n\n        IF(S65=3,\n            IF(AND($I$53>1000, $I$53<=3000), \"geen\",\n            IF(AND($I$53>3000, $I$53<=10000), \"klein\",\n            IF($I$53>10000, \"sterk\", \"klein\"))),\n\n            IF(S65=4,\n                IF($I$53<=3000, \"geen\",\n                IF(AND($I$53>3000, $I$53<=10000), \"klein\",\n                IF($I$53>10000, \"sterk\"))),\n\n                IF(S65=5,\n                    IF($I$53<=10000, \"geen\",\n                    IF($I$53>10000, \"klein\")),\n\n                    IF(S65=6, \"geen\", \"geen\")))))),\"-\")","v":"-"},null,null,{"$f":"IF(LEFT(C42,1)=\"E\",0,1)","v":0},{"$f":"IF($I$53=\"niet opgegeven\",0,_xlfn.XLOOKUP(G65,Invoer!$I$34:$I$39,Invoer!$J$34:$J$39))","v":{"$error":"#N/A"}},{"$f":"IF(AND(C65<>\"\",LEFT(bool_toets_verstoring,2)=\"Ja\"),1,0)","v":0},null,{"$f":"IF(G65<>\"\",G65,\"-\")","v":"-"},{"$f":"IF($V65<>\"-\",_xlfn.XLOOKUP(1,(('Grenswaarden KRW'!$B:$B=$V65)*('Grenswaarden KRW'!$C:$C=$K65)),'Grenswaarden KRW'!G:G, \"Nee\"),\"-\")","v":"-"},{"$f":"IF($V65<>\"-\",_xlfn.XLOOKUP(1,(('Grenswaarden KRW'!$B:$B=$V65)*('Grenswaarden KRW'!$C:$C=$K65)),'Grenswaarden KRW'!H:H, \"Nee\"),\"-\")","v":"-"},{"$f":"IF($V65<>\"-\",_xlfn.XLOOKUP(1,(('Grenswaarden KRW'!$B:$B=$V65)*('Grenswaarden KRW'!$C:$C=$K65)),'Grenswaarden KRW'!I:I, \"Nee\"),\"-\")","v":"-"},{"$f":"IF($V65<>\"-\",_xlfn.XLOOKUP(1,(('Grenswaarden KRW'!$B:$B=$V65)*('Grenswaarden KRW'!$C:$C=$K65)),'Grenswaarden KRW'!J:J, \"Nee\"),\"-\")","v":"-"},{"$f":"IF($V65<>\"-\",_xlfn.XLOOKUP(1,(('Grenswaarden KRW'!$B:$B=$V65)*('Grenswaarden KRW'!$C:$C=$K65)),'Grenswaarden KRW'!K:K, \"Nee\"),\"-\")","v":"-"},null,{"$f":"IF($V65<>\"-\",_xlfn.XLOOKUP(1,(('Grenswaarden KRW'!$B:$B=$V65)*('Grenswaarden KRW'!$D:$D=$M65)),'Grenswaarden KRW'!G:G, \"Nee\"),\"-\")","v":"-"},{"$f":"IF($V65<>\"-\",_xlfn.XLOOKUP(1,(('Grenswaarden KRW'!$B:$B=$V65)*('Grenswaarden KRW'!$D:$D=$M65)),'Grenswaarden KRW'!H:H, \"Nee\"),\"-\")","v":"-"},{"$f":"IF($V65<>\"-\",_xlfn.XLOOKUP(1,(('Grenswaarden KRW'!$B:$B=$V65)*('Grenswaarden KRW'!$D:$D=$M65)),'Grenswaarden KRW'!I:I, \"Nee\"),\"-\")","v":"-"},{"$f":"IF($V65<>\"-\",_xlfn.XLOOKUP(1,(('Grenswaarden KRW'!$B:$B=$V65)*('Grenswaarden KRW'!$D:$D=$M65)),'Grenswaarden KRW'!J:J, \"Nee\"),\"-\")","v":"-"},{"$f":"IF($V65<>\"-\",_xlfn.XLOOKUP(1,(('Grenswaarden KRW'!$B:$B=$V65)*('Grenswaarden KRW'!$D:$D=$M65)),'Grenswaarden KRW'!K:K, \"Nee\"),\"-\")","v":"-"},null,{"$f":"IF($V65<>\"-\",_xlfn.XLOOKUP(1,(('Grenswaarden KRW'!$B:$B=$V65)*('Grenswaarden KRW'!$E:$E=$O65)),'Grenswaarden KRW'!G:G, \"Nee\"),\"-\")","v":"-"},{"$f":"IF($V65<>\"-\",_xlfn.XLOOKUP(1,(('Grenswaarden KRW'!$B:$B=$V65)*('Grenswaarden KRW'!$E:$E=$O65)),'Grenswaarden KRW'!H:H, \"Nee\"),\"-\")","v":"-"},{"$f":"IF($V65<>\"-\",_xlfn.XLOOKUP(1,(('Grenswaarden KRW'!$B:$B=$V65)*('Grenswaarden KRW'!$E:$E=$O65)),'Grenswaarden KRW'!I:I, \"Nee\"),\"-\")","v":"-"},{"$f":"IF($V65<>\"-\",_xlfn.XLOOKUP(1,(('Grenswaarden KRW'!$B:$B=$V65)*('Grenswaarden KRW'!$E:$E=$O65)),'Grenswaarden KRW'!J:J, \"Nee\"),\"-\")","v":"-"},{"$f":"IF($V65<>\"-\",_xlfn.XLOOKUP(1,(('Grenswaarden KRW'!$B:$B=$V65)*('Grenswaarden KRW'!$E:$E=$O65)),'Grenswaarden KRW'!K:K, \"Nee\"),\"-\")","v":"-"}]
[null,null,null,null,{"$f":"_xlfn.XLOOKUP(C66,'Grenswaarden Terrestrisch'!$A$40:$A$62,'Grenswaarden Terrestrisch'!$F$40:$F$62,\"\")","v":""},null,{"$f":"IF(AND(C66<>\"\",'3. KRW'!J84<>\"\"),'3. KRW'!J84,\"-\")","v":"-"},null,"",null,{"$f":"IF(AND(G66<>\"-\",G66<>0,$I$53<>\"niet opgegeven\"),IF(S66=1, IF($I$53>300, \"zeer sterk\", \"geen\"),\n   IF(OR(S66=2, S66=3),\n      IF($I$53<=1000, \"geen\",\n      IF(AND($I$53>1000, $I$53<=10000), \"sterk\",\n      IF($I$53>10000, \"zeer sterk\", \"geen\"))),\n   IF(S66=4,\n      IF($I$53<=3000, \"geen\",\n      IF($I$53>3000, \"sterk\")),\n   IF(S66=5,\n      IF($I$53<=10000, \"geen\",\n      IF($I$53>10000, \"klein\")),\n   IF(S66=6, \"geen\", \"geen\"))))),\"-\")","v":"-"},null,{"$f":"IF(AND(G66<>\"-\",G66<>0,$I$53<>\"niet opgegeven\"),IF(S66=1,\n    IF(AND($I$53>300, $I$53<=3000), \"sterk\",\n    IF($I$53>3000, \"zeer sterk\", \"geen\")),\n\n    IF(S66=2,\n        IF(AND($I$53>300, $I$53<=1000), \"geen\",\n        IF($I$53>1000, \"sterk\", \"geen\")),\n\n        IF(S66=3,\n            IF(AND($I$53>300, $I$53<=3000), \"matig\",\n            IF(AND($I$53>3000, $I$53<=10000), \"sterk\",\n            IF($I$53>10000, \"zeer sterk\", \"geen\"))),\n\n            IF(S66=4,\n                IF($I$53<=3000, \"geen\",\n                IF($I$53>3000, \"sterk\")),\n\n                IF(S66=5,\n                    IF($I$53<=10000, \"geen\",\n                    IF($I$53>10000, \"klein\")),\n\n                    IF(S66=6, \"geen\", \"geen\")))))),\"-\")","v":"-"},null,{"$f":"IF(AND(G66<>\"-\",G66<>0,$I$53<>\"niet opgegeven\"),IF(S66=1,\n    IF(AND($I$53>300, $I$53<=3000), \"matig\",\n    IF($I$53>3000, \"sterk\", \"geen\")),\n\n    IF(S66=2,\n        IF(AND($I$53>300, $I$53<=1000), \"geen\",\n        IF(AND($I$53>1000, $I$53<=3000), \"klein\",\n        IF(AND($I$53>3000, $I$53<=10000), \"matig\",\n        IF($I$53>10000, \"sterk\", \"geen\")))),\n\n        IF(S66=3,\n            IF(AND($I$53>1000, $I$53<=3000), \"geen\",\n            IF(AND($I$53>3000, $I$53<=10000), \"klein\",\n            IF($I$53>10000, \"sterk\", \"klein\"))),\n\n            IF(S66=4,\n                IF($I$53<=3000, \"geen\",\n                IF(AND($I$53>3000, $I$53<=10000), \"klein\",\n                IF($I$53>10000, \"sterk\"))),\n\n                IF(S66=5,\n                    IF($I$53<=10000, \"geen\",\n                    IF($I$53>10000, \"klein\")),\n\n                    IF(S66=6, \"geen\", \"geen\")))))),\"-\")","v":"-"},null,null,{"$f":"IF(LEFT(C43,1)=\"E\",0,1)","v":1},{"$f":"IF($I$53=\"niet opgegeven\",0,_xlfn.XLOOKUP(G66,Invoer!$I$34:$I$39,Invoer!$J$34:$J$39))","v":{"$error":"#N/A"}},{"$f":"IF(AND(C66<>\"\",LEFT(bool_toets_verstoring,2)=\"Ja\"),1,0)","v":0},null,"-",{"$f":"IF($V66<>\"-\",_xlfn.XLOOKUP(1,(('Grenswaarden KRW'!$B:$B=$V66)*('Grenswaarden KRW'!$C:$C=$K66)),'Grenswaarden KRW'!G:G, \"Nee\"),\"-\")","v":"-"},{"$f":"IF($V66<>\"-\",_xlfn.XLOOKUP(1,(('Grenswaarden KRW'!$B:$B=$V66)*('Grenswaarden KRW'!$C:$C=$K66)),'Grenswaarden KRW'!H:H, \"Nee\"),\"-\")","v":"-"},{"$f":"IF($V66<>\"-\",_xlfn.XLOOKUP(1,(('Grenswaarden KRW'!$B:$B=$V66)*('Grenswaarden KRW'!$C:$C=$K66)),'Grenswaarden KRW'!I:I, \"Nee\"),\"-\")","v":"-"},{"$f":"IF($V66<>\"-\",_xlfn.XLOOKUP(1,(('Grenswaarden KRW'!$B:$B=$V66)*('Grenswaarden KRW'!$C:$C=$K66)),'Grenswaarden KRW'!J:J, \"Nee\"),\"-\")","v":"-"},{"$f":"IF($V66<>\"-\",_xlfn.XLOOKUP(1,(('Grenswaarden KRW'!$B:$B=$V66)*('Grenswaarden KRW'!$C:$C=$K66)),'Grenswaarden KRW'!K:K, \"Nee\"),\"-\")","v":"-"},null,{"$f":"IF($V66<>\"-\",_xlfn.XLOOKUP(1,(('Grenswaarden KRW'!$B:$B=$V66)*('Grenswaarden KRW'!$D:$D=$M66)),'Grenswaarden KRW'!G:G, \"Nee\"),\"-\")","v":"-"},{"$f":"IF($V66<>\"-\",_xlfn.XLOOKUP(1,(('Grenswaarden KRW'!$B:$B=$V66)*('Grenswaarden KRW'!$D:$D=$M66)),'Grenswaarden KRW'!H:H, \"Nee\"),\"-\")","v":"-"},{"$f":"IF($V66<>\"-\",_xlfn.XLOOKUP(1,(('Grenswaarden KRW'!$B:$B=$V66)*('Grenswaarden KRW'!$D:$D=$M66)),'Grenswaarden KRW'!I:I, \"Nee\"),\"-\")","v":"-"},{"$f":"IF($V66<>\"-\",_xlfn.XLOOKUP(1,(('Grenswaarden KRW'!$B:$B=$V66)*('Grenswaarden KRW'!$D:$D=$M66)),'Grenswaarden KRW'!J:J, \"Nee\"),\"-\")","v":"-"},{"$f":"IF($V66<>\"-\",_xlfn.XLOOKUP(1,(('Grenswaarden KRW'!$B:$B=$V66)*('Grenswaarden KRW'!$D:$D=$M66)),'Grenswaarden KRW'!K:K, \"Nee\"),\"-\")","v":"-"},null,{"$f":"IF($V66<>\"-\",_xlfn.XLOOKUP(1,(('Grenswaarden KRW'!$B:$B=$V66)*('Grenswaarden KRW'!$E:$E=$O66)),'Grenswaarden KRW'!G:G, \"Nee\"),\"-\")","v":"-"},{"$f":"IF($V66<>\"-\",_xlfn.XLOOKUP(1,(('Grenswaarden KRW'!$B:$B=$V66)*('Grenswaarden KRW'!$E:$E=$O66)),'Grenswaarden KRW'!H:H, \"Nee\"),\"-\")","v":"-"},{"$f":"IF($V66<>\"-\",_xlfn.XLOOKUP(1,(('Grenswaarden KRW'!$B:$B=$V66)*('Grenswaarden KRW'!$E:$E=$O66)),'Grenswaarden KRW'!I:I, \"Nee\"),\"-\")","v":"-"},{"$f":"IF($V66<>\"-\",_xlfn.XLOOKUP(1,(('Grenswaarden KRW'!$B:$B=$V66)*('Grenswaarden KRW'!$E:$E=$O66)),'Grenswaarden KRW'!J:J, \"Nee\"),\"-\")","v":"-"},{"$f":"IF($V66<>\"-\",_xlfn.XLOOKUP(1,(('Grenswaarden KRW'!$B:$B=$V66)*('Grenswaarden KRW'!$E:$E=$O66)),'Grenswaarden KRW'!K:K, \"Nee\"),\"-\")","v":"-"}]
[null,null,{"$f":"C44","v":""},null,null,null,null,null,null,null,null,null,null,null,null,null,null,null,null,{"$f":"IF(LEFT(bool_toets_verstoring,2)=\"Ja\",1,0)","v":0}]

{"sheet":"Risicolegger Terrestrisch","index":9,"n_rows":162,"n_cols":20,"rows_kept":162,"cut":false,"hidden":false,"merged":[[140,0,159,0],[85,0,103,0],[36,0,83,0],[1,0,34,0],[51,2,51,4],[39,2,39,4],[90,2,90,4],[88,2,88,4],[89,2,89,4],[105,0,138,0]]}
[null,null,null,null,null,null,null,null,null,null,null,null,null,null,null,null,null,null,1]
["BLOK 1: BIOTISCHE GEVOELIGHEID\n- HUIDIGE SITUATIE -",null,null,null,null,null,null,null,null,null,null,null,null,null,null,null,null,null,1]
[null,null,"Oordeelsblok 1: biotische gevoeligheid zoutgehalte huidige situatie",null,null,null,null,null,null,null,"N.B.: De verstoring wordt pas beoordeeld in BLOK 3.",null,null,null,null,null,null,null,1]
[null,null,null,null,null,null,null,null,null,null,null,null,null,null,null,null,null,null,1]
[null,null,"In dit eerste blok ziet u de risicobepaling voor de ingevoerde habitattypen en beheertypen in de huidige situatie.",null,null,null,null,null,null,null,null,null,null,null,null,null,null,null,1]
[null,null,"Om uitvoer te zien, dient u te hebben aangegeven welk(e) habitat-/beheertype(n) u wilt doorlichten, wat de huidige staat van kwaliteit is en met welke zouteenheid (EC of chloride) u rekent.",null,null,null,null,null,null,null,null,null,null,null,null,null,null,null,1]
[null,null,"Voor het maken van de risicobepaling, wordt het zoutgehalte van het oppervlaktewater vergeleken met de grenswaarden voor verzilting en verzoeting van de ingevoerde habitattypen en beheertypen. ",null,null,null,null,null,null,null,null,null,null,null,null,null,null,null,1]
[null,null,null,null,null,null,null,null,null,null,null,null,null,null,null,null,null,null,1]
[null,null,{"$f":"IF(eenheid_zoutgehalte_algemeen<>\"\",_xlfn.CONCAT(\"De eenheid van het zoutgehalte die door u is opgegeven, is: \"),\n\"De eenheid van het zoutgehalte is nog niet opgegeven. Het is nog niet mogelijk risico's in te schatten.\")","v":"De eenheid van het zoutgehalte is nog niet opgegeven. Het is nog niet mogelijk risico's in te schatten."},null,{"$f":"IF(eenheid_zoutgehalte_algemeen=\"\",\"onbekend\", eenheid_zoutgehalte_algemeen)","v":"onbekend"},null,"Maximaal zoutgehalte:",null,{"$f":"IF(R9=1,165*maximaal_zout_huidig^1.3438,maximaal_zout_huidig)","v":0},"mg Cl/l",null,null,null,null,null,null,null,{"$f":"IF(E9=\"EC-waarde\",1,IF(E9=\"Chloridegehalte\",2,0))","v":0},1]
[null,null,{"$f":"IF(R9=1,\"De ingevulde EC waardes worden voor de functie terrestrische natuur omgerekend naar chloridegehaltes.\",\"\")","v":""},null,null,null,"Minimaal zoutgehalte:",null,{"$f":"IF(R9=1,165*minimaal_zout_huidig^1.3438,minimaal_zout_huidig)","v":0},"mg Cl/l",null,null,null,null,null,null,null,null,1]
[null,null,"NNN beheertypen",null,null,null,null,null,null,null,null,null,null,null,null,null,null,null,1]
[null,null,"Het risico wordt voornamelijk bepaald door de zouttolerantie (gevoelig = hoog, matig tolerant = midden, tolerant = laag) en wordt bijgesteld naar 'hoog' als de grenswaarde wordt overschreden.",null,null,null,null,null,null,null,null,null,null,null,null,null,null,null,1]
[null,null,"Geselecteerde beheertypen",null,"Zouttolerantie",null,null,null,"Grenswaarde zout (mg Cl/l)",null,"Grenswaarde overschreden?",null,"Risico voor verzilting",null,null,null,null,null,1]
[null,null,{"$f":"_xlfn._xlws.FILTER('4. Terrestrisch'!C10:C37,'4. Terrestrisch'!E10:E37=1,\"… nog geen beheertypen geselecteerd op tabblad 4. Terrestrisch ...\")","v":"… nog geen beheertypen geselecteerd op tabblad 4. Terrestrisch ..."},null,{"$f":"IF(C14<>\"\",_xlfn.XLOOKUP(C14,'Grenswaarden Terrestrisch'!$A$5:$A$33,'Grenswaarden Terrestrisch'!$F$5:$F$33,\"-\"))","v":"-"},null,null,null,{"$f":"IF(C14<>\"\",_xlfn.XLOOKUP(C14,'Grenswaarden Terrestrisch'!$A$5:$A$33,'Grenswaarden Terrestrisch'!$D$5:$D$33,\"-\"),\"-\")","v":"-"},null,{"$f":"IF(SUM('4. Terrestrisch'!$E$10:$E$37)>0,IF($I$9=0,\"-\",IF(I14<=$I$9,\"Ja\",\"Nee\")),\"-\")","v":"-"},null,{"$f":"IF(K14=\"Ja\",\"hoog\",IF(SUM('4. Terrestrisch'!$E$10:$E$37)>0,IF($I$9=0,\"-\",IF(E14=\"tolerant\",\"laag\",\nIF(E14=\"matig tolerant\",\"midden\",\nIF(E14=\"gevoelig\",\"hoog\")))),\"-\"))","v":"-"},null,null,null,null,null,{"$f":"IF(C14<>\"\",1,0)","v":1}]
[null,null,null,null,{"$f":"IF(C15<>\"\",_xlfn.XLOOKUP(C15,'Grenswaarden Terrestrisch'!$A$5:$A$33,'Grenswaarden Terrestrisch'!$F$5:$F$33,\"\"),\"\")","v":""},null,null,null,{"$f":"IF(C15<>\"\",_xlfn.XLOOKUP(C15,'Grenswaarden Terrestrisch'!$A$5:$A$33,'Grenswaarden Terrestrisch'!$D$5:$D$33,\"\"),\"\")","v":""},null,{"$f":"IF(SUM('4. Terrestrisch'!$E$10:$E$37)>0,IF($I$9=0,\"-\",IF(I15<=$I$9,\"Ja\",\"Nee\")))","v":false},null,{"$f":"IF($I$9=0,\"-\",IF(K15=\"Ja\",\"hoog\",IF(E15=\"tolerant\",\"laag\",IF(E15=\"matig tolerant\",\"midden\",IF(E15=\"gevoelig\",\"hoog\",\"\")))))","v":"-"},null,null,null,null,null,{"$f":"IF(C15<>\"\",1,0)","v":0}]
[null,null,null,null,{"$f":"IF(C16<>\"\",_xlfn.XLOOKUP(C16,'Grenswaarden Terrestrisch'!$A$5:$A$33,'Grenswaarden Terrestrisch'!$F$5:$F$33,\"\"),\"\")","v":""},null,null,null,{"$f":"IF(C16<>\"\",_xlfn.XLOOKUP(C16,'Grenswaarden Terrestrisch'!$A$5:$A$33,'Grenswaarden Terrestrisch'!$D$5:$D$33,\"\"),\"\")","v":""},null,{"$f":"IF(SUM('4. Terrestrisch'!$E$10:$E$37)>0,IF($I$9=0,\"-\",IF(I16<=$I$9,\"Ja\",\"Nee\")))","v":false},null,{"$f":"IF($I$9=0,\"-\",IF(K16=\"Ja\",\"hoog\",IF(E16=\"tolerant\",\"laag\",IF(E16=\"matig tolerant\",\"midden\",IF(E16=\"gevoelig\",\"hoog\",\"\")))))","v":"-"},null,null,null,null,null,0]
[null,null,null,null,{"$f":"IF(C17<>\"\",_xlfn.XLOOKUP(C17,'Grenswaarden Terrestrisch'!$A$5:$A$33,'Grenswaarden Terrestrisch'!$F$5:$F$33,\"\"),\"\")","v":""},null,null,null,{"$f":"IF(C17<>\"\",_xlfn.XLOOKUP(C17,'Grenswaarden Terrestrisch'!$A$5:$A$33,'Grenswaarden Terrestrisch'!$D$5:$D$33,\"\"),\"\")","v":""},null,{"$f":"IF(SUM('4. Terrestrisch'!$E$10:$E$37)>0,IF($I$9=0,\"-\",IF(I17<=$I$9,\"Ja\",\"Nee\")))","v":false},null,{"$f":"IF($I$9=0,\"-\",IF(K17=\"Ja\",\"hoog\",IF(E17=\"tolerant\",\"laag\",IF(E17=\"matig tolerant\",\"midden\",IF(E17=\"gevoelig\",\"hoog\",\"\")))))","v":"-"},null,null,null,null,null,0]
[null,null,null,null,{"$f":"IF(C18<>\"\",_xlfn.XLOOKUP(C18,'Grenswaarden Terrestrisch'!$A$5:$A$33,'Grenswaarden Terrestrisch'!$F$5:$F$33,\"\"),\"\")","v":""},null,null,null,{"$f":"IF(C18<>\"\",_xlfn.XLOOKUP(C18,'Grenswaarden Terrestrisch'!$A$5:$A$33,'Grenswaarden Terrestrisch'!$D$5:$D$33,\"\"),\"\")","v":""},null,{"$f":"IF(SUM('4. Terrestrisch'!$E$10:$E$37)>0,IF($I$9=0,\"-\",IF(I18<=$I$9,\"Ja\",\"Nee\")))","v":false},null,{"$f":"IF($I$9=0,\"-\",IF(K18=\"Ja\",\"hoog\",IF(E18=\"tolerant\",\"laag\",IF(E18=\"matig tolerant\",\"midden\",IF(E18=\"gevoelig\",\"hoog\",\"\")))))","v":"-"},null,null,null,null,null,0]
[null,null,null,null,null,null,{"$f":"IF(E19=\"tolerant\",\"laag\",IF(E19=\"matig tolerant\",\"midden\",IF(E19=\"gevoelig\",\"hoog\",\"\")))","v":""},null,null,null,null,null,null,null,null,null,null,null,1,{"$f":"SUM(S14:S18)","v":1}]
[null,null,"N2000 Habitattypen",null,null,null,{"$f":"IF(E20=\"tolerant\",\"laag\",IF(E20=\"matig tolerant\",\"midden\",IF(E20=\"gevoelig\",\"hoog\",\"\")))","v":""},null,null,null,null,null,null,null,null,null,null,null,1]
[null,null,"Het risico wordt bepaald door de zouttolerantie (idem als NNN beheertypen) en wordt bijgesteld naar 'hoog' als de grenswaarde wordt overschreden. Als de staat van kwaliteit slecht/onbekend is, wordt het risico met één niveau verhoogd.",null,null,null,null,null,null,null,null,null,null,null,null,null,null,null,1]
[null,null,"Verzoeting:",null,null,null,null,null,null,null,null,null,null,null,null,null,null,null,1]
[null,null,"Geselecteerde habitattypen",null,"Zouttolerantie",null,"Staat van kwaliteit",null,"Grenswaarde zoet (mg Cl/l)",null,"Grenswaarde onderschreden?",null,"Risico voor verzoeting",null,null,null,null,null,1]
[null,null,{"$f":"_xlfn._xlws.FILTER('4. Terrestrisch'!I10:I11,'4. Terrestrisch'!K10:K11=1,\"… nog geen habitattypen geselecteerd die te maken kunnen krijgen met verzoeting…\")","v":"… nog geen habitattypen geselecteerd die te maken kunnen krijgen met verzoeting…"},null,{"$f":"_xlfn.XLOOKUP(C24,'Grenswaarden Terrestrisch'!$A$38:$A$39,'Grenswaarden Terrestrisch'!$F$38:$F$39,\"-\")","v":"-"},null,{"$f":"_xlfn.XLOOKUP(C24,'4. Terrestrisch'!$I$10:$I$34,'4. Terrestrisch'!$M$10:$M$34,\"-\")","v":"-"},null,{"$f":"IF(C24<>\"\",_xlfn.XLOOKUP(C24,'Grenswaarden Terrestrisch'!$A$38:$A$62,'Grenswaarden Terrestrisch'!$B$38:$B$62,\"-\"),\"-\")","v":"-"},null,{"$f":"IF(SUM('4. Terrestrisch'!$K$10:$K$11)>0,IF($I$10=0,\"-\",IF(I24>=$I$10,\"Ja\",\"Nee\")),\"-\")","v":"-"},null,{"$f":"IF(SUM('4. Terrestrisch'!K10:K11)>0,IF($I$10=0,\"-\",IF(K24=\"Ja\",\"hoog\",IF(E24=\"tolerant\",IF(OR(G24=\"slecht\",G24=\"onbekend\"),\"midden\",\"laag\"),\nIF(E24=\"matig tolerant\",IF(OR(G24=\"slecht\",G24=\"onbekend\"),\"hoog\",\"midden\"),\nIF(E24=\"gevoelig\",\"hoog\"))))),\"-\")","v":"-"},null,null,null,null,null,1]
[null,null,null,null,{"$f":"_xlfn.XLOOKUP(C25,'Grenswaarden Terrestrisch'!$A$38:$A$39,'Grenswaarden Terrestrisch'!$F$38:$F$39,\"\")","v":""},null,{"$f":"_xlfn.XLOOKUP(C25,'4. Terrestrisch'!$I$10:$I$34,'4. Terrestrisch'!$M$10:$M$34,\"-\")","v":"-"},null,{"$f":"IF(C25<>\"\",_xlfn.XLOOKUP(C25,'Grenswaarden Terrestrisch'!$A$38:$A$62,'Grenswaarden Terrestrisch'!$B$38:$B$62,\"\"),\"\")","v":""},null,{"$f":"IF(SUM('4. Terrestrisch'!$K$10:$K$11)>0,IF($I$10=0,\"-\",IF(I25>=$I$10,\"Ja\",\"Nee\")))","v":false},null,{"$f":"IF(SUM('4. Terrestrisch'!K11:K12)>0,IF($I$10=0,\"-\",IF(K25=\"Ja\",\"hoog\",IF(E25=\"tolerant\",IF(OR(G25=\"slecht\",G25=\"onbekend\"),\"midden\",\"laag\"),\nIF(E25=\"matig tolerant\",IF(OR(G25=\"slecht\",G25=\"onbekend\"),\"hoog\",\"midden\"),\nIF(E25=\"gevoelig\",\"hoog\"))))))","v":false},null,null,null,null,null,0]
[null,null,null,null,null,null,null,null,null,null,null,null,null,null,null,null,null,null,1,{"$f":"SUM(S24:S25)","v":1}]
[null,null,"Verzilting:",null,null,null,null,null,null,null,null,null,null,null,null,null,null,null,1]
[null,null,"Geselecteerde habitattypen",null,"Zouttolerantie",null,"Staat van kwaliteit",null,"Grenswaarde zout (mg Cl/l)",null,"Grenswaarde overschreden?",null,"Risico voor verzilting",null,null,null,null,null,1]
[null,null,{"$f":"_xlfn._xlws.FILTER('4. Terrestrisch'!I12:I34,'4. Terrestrisch'!K12:K34,\"… nog geen habitattypen geselecteerd die te maken kunnen krijgen met verzilting …\")","v":"… nog geen habitattypen geselecteerd die te maken kunnen krijgen met verzilting …"},null,{"$f":"_xlfn.XLOOKUP(C29,'Grenswaarden Terrestrisch'!$A$40:$A$62,'Grenswaarden Terrestrisch'!$F$40:$F$62,\"-\")","v":"-"},null,{"$f":"_xlfn.XLOOKUP(C29,'4. Terrestrisch'!$I$10:$I$34,'4. Terrestrisch'!$M$10:$M$34,\"-\")","v":"-"},null,{"$f":"IF(C29<>\"\",_xlfn.XLOOKUP(C29,'Grenswaarden Terrestrisch'!$A$38:$A$62,'Grenswaarden Terrestrisch'!$D$38:$D$62,\"-\"),\"-\")","v":"-"},null,{"$f":"IF(SUM('4. Terrestrisch'!$K$12:$K$34)>0,IF($I$9=0,\"-\",IF(I29<=$I$9,\"Ja\",\"Nee\")),\"-\")","v":"-"},null,{"$f":"IF(K29=\"Ja\",\"hoog\",IF(SUM('4. Terrestrisch'!$K$12:$K$34)>0,IF($I$9=0,\"-\",IF(E29=\"tolerant\",IF(OR(G29=\"slecht\",G29=\"onbekend\"),\"midden\",\"laag\"),\nIF(E29=\"matig tolerant\",IF(OR(G29=\"slecht\",G29=\"onbekend\"),\"hoog\",\"midden\"),\nIF(E29=\"gevoelig\",\"hoog\")))),\"-\"))","v":"-"},null,null,null,null,null,1]
[null,null,null,null,{"$f":"_xlfn.XLOOKUP(C30,'Grenswaarden Terrestrisch'!$A$40:$A$62,'Grenswaarden Terrestrisch'!$F$40:$F$62,\"\")","v":""},null,{"$f":"_xlfn.XLOOKUP(C30,'4. Terrestrisch'!$I$10:$I$34,'4. Terrestrisch'!$M$10:$M$34,\"-\")","v":"-"},null,{"$f":"IF(C30<>\"\",_xlfn.XLOOKUP(C30,'Grenswaarden Terrestrisch'!$A$38:$A$62,'Grenswaarden Terrestrisch'!$D$38:$D$62,\"\"),\"\")","v":""},null,{"$f":"IF(SUM('4. Terrestrisch'!$K$12:$K$34)>0,IF($I$9=0,\"-\",IF(I30<=$I$9,\"Ja\",\"Nee\")))","v":false},null,{"$f":"IF(K30=\"Ja\",\"hoog\",IF(SUM('4. Terrestrisch'!$K$12:$K$34)>0,IF($I$9=0,\"-\",IF(E30=\"tolerant\",IF(OR(G30=\"slecht\",G30=\"onbekend\"),\"midden\",\"laag\"),\nIF(E30=\"matig tolerant\",IF(OR(G30=\"slecht\",G30=\"onbekend\"),\"hoog\",\"midden\"),\nIF(E30=\"gevoelig\",\"hoog\"))))))","v":false},null,null,null,null,null,0]
[null,null,null,null,{"$f":"_xlfn.XLOOKUP(C31,'Grenswaarden Terrestrisch'!$A$40:$A$62,'Grenswaarden Terrestrisch'!$F$40:$F$62,\"\")","v":""},null,{"$f":"_xlfn.XLOOKUP(C31,'4. Terrestrisch'!$I$10:$I$34,'4. Terrestrisch'!$M$10:$M$34,\"-\")","v":"-"},null,{"$f":"IF(C31<>\"\",_xlfn.XLOOKUP(C31,'Grenswaarden Terrestrisch'!$A$38:$A$62,'Grenswaarden Terrestrisch'!$D$38:$D$62,\"\"),\"\")","v":""},null,{"$f":"IF(SUM('4. Terrestrisch'!$K$12:$K$34)>0,IF($I$9=0,\"-\",IF(I31<=$I$9,\"Ja\",\"Nee\")))","v":false},null,{"$f":"IF(K31=\"Ja\",\"hoog\",IF(SUM('4. Terrestrisch'!$K$12:$K$34)>0,IF($I$9=0,\"-\",IF(E31=\"tolerant\",IF(OR(G31=\"slecht\",G31=\"onbekend\"),\"midden\",\"laag\"),\nIF(E31=\"matig tolerant\",IF(OR(G31=\"slecht\",G31=\"onbekend\"),\"hoog\",\"midden\"),\nIF(E31=\"gevoelig\",\"hoog\"))))))","v":false},null,null,null,null,null,0]
[null,null,null,null,{"$f":"_xlfn.XLOOKUP(C32,'Grenswaarden Terrestrisch'!$A$40:$A$62,'Grenswaarden Terrestrisch'!$F$40:$F$62,\"\")","v":""},null,{"$f":"_xlfn.XLOOKUP(C32,'4. Terrestrisch'!$I$10:$I$34,'4. Terrestrisch'!$M$10:$M$34,\"-\")","v":"-"},null,{"$f":"IF(C32<>\"\",_xlfn.XLOOKUP(C32,'Grenswaarden Terrestrisch'!$A$38:$A$62,'Grenswaarden Terrestrisch'!$D$38:$D$62,\"\"),\"\")","v":""},null,{"$f":"IF(SUM('4. Terrestrisch'!$K$12:$K$34)>0,IF($I$9=0,\"-\",IF(I32<=$I$9,\"Ja\",\"Nee\")))","v":false},null,{"$f":"IF(K32=\"Ja\",\"hoog\",IF(SUM('4. Terrestrisch'!$K$12:$K$34)>0,IF($I$9=0,\"-\",IF(E32=\"tolerant\",IF(OR(G32=\"slecht\",G32=\"onbekend\"),\"midden\",\"laag\"),\nIF(E32=\"matig tolerant\",IF(OR(G32=\"slecht\",G32=\"onbekend\"),\"hoog\",\"midden\"),\nIF(E32=\"gevoelig\",\"hoog\"))))))","v":false},null,null,null,null,null,0]
[null,null,null,null,{"$f":"_xlfn.XLOOKUP(C33,'Grenswaarden Terrestrisch'!$A$40:$A$62,'Grenswaarden Terrestrisch'!$F$40:$F$62,\"\")","v":""},null,{"$f":"_xlfn.XLOOKUP(C33,'4. Terrestrisch'!$I$10:$I$34,'4. Terrestrisch'!$M$10:$M$34,\"-\")","v":"-"},null,{"$f":"IF(C33<>\"\",_xlfn.XLOOKUP(C33,'Grenswaarden Terrestrisch'!$A$38:$A$62,'Grenswaarden Terrestrisch'!$D$38:$D$62,\"\"),\"\")","v":""},null,{"$f":"IF(SUM('4. Terrestrisch'!$K$12:$K$34)>0,IF($I$9=0,\"-\",IF(I33<=$I$9,\"Ja\",\"Nee\")))","v":false},null,{"$f":"IF(K33=\"Ja\",\"hoog\",IF(SUM('4. Terrestrisch'!$K$12:$K$34)>0,IF($I$9=0,\"-\",IF(E33=\"tolerant\",IF(OR(G33=\"slecht\",G33=\"onbekend\"),\"midden\",\"laag\"),\nIF(E33=\"matig tolerant\",IF(OR(G33=\"slecht\",G33=\"onbekend\"),\"hoog\",\"midden\"),\nIF(E33=\"gevoelig\",\"hoog\"))))))","v":false},null,null,null,null,null,0]
[null,null,null,null,{"$f":"_xlfn.XLOOKUP(C34,'Grenswaarden Terrestrisch'!$A$40:$A$62,'Grenswaarden Terrestrisch'!$F$40:$F$62,\"\")","v":""},null,{"$f":"_xlfn.XLOOKUP(C34,'4. Terrestrisch'!$I$10:$I$34,'4. Terrestrisch'!$M$10:$M$34,\"\")","v":""},null,{"$f":"IF(C34<>\"\",_xlfn.XLOOKUP(C34,'Grenswaarden Terrestrisch'!$A$38:$A$62,'Grenswaarden Terrestrisch'!$D$38:$D$62,\"\"),\"\")","v":""},null,null,null,null,null,null,null,null,null,0]
[null,null,null,null,null,null,null,null,null,null,null,null,null,null,null,null,null,null,1,{"$f":"SUM(S29:S34)","v":1}]
[null,null,null,null,null,null,null,null,null,null,null,null,null,null,null,null,null,null,1]
["BLOK 2: ABIOTISCHE GEVOELIGHEID\n- HUIDIGE SITUATIE -",null,null,null,null,null,null,null,null,null,null,null,null,null,null,null,null,null,1]
[null,null,"Oordeelsblok 2: abiotische gevoeligheid zoutgehalte huidige situatie",null,null,"N.B.: De verstoring wordt beoordeeld in BLOK 3.",null,null,null,null,null,null,null,null,null,null,null,null,1]
[null,null,null,null,null,null,null,null,null,null,null,null,null,null,null,null,null,null,1]
[null,null,"Het totale risico voor verzilting (en verzoeting) wordt mede bepaald door de gevoeligheid van het abiotische systeem. Hierbij spelen factoren die de gevoeligheid bepalen:",null,null,null,null,null,null,null,null,null,null,null,null,null,null,null,1]
[null,null,"-       Werking van het watersysteem:",null,null,null,null,null,null,null,null,null,null,null,null,null,null,null,1]
[null,null,"·        Verblijftijd als mate van isolatie van een waterlichaam;",null,null,null,null,null,null,null,null,null,null,null,null,null,null,null,1]
[null,null,"·        Aanwezigheid van brakke kwel;",null,null,null,null,null,null,null,null,null,null,null,null,null,null,null,1]
[null,null,"-       Hoe gemakkelijk kan zout of zoet water de wortelzone bereiken",null,null,null,null,null,null,null,null,null,null,null,null,null,null,null,1]
[null,null,"·        Dichtheid sloten / land-water contact;",null,null,null,null,null,null,null,null,null,null,null,null,null,null,null,1]
[null,null,"·        Bodemweerstand",null,null,null,null,null,null,null,null,null,null,null,null,null,null,null,1]
[null,null,"·        Noodzaak voor bevloeiing ",null,null,null,null,null,null,null,null,null,null,null,null,null,null,null,1]
[null,null,null,null,null,null,null,null,null,null,null,null,null,null,null,null,null,null,1]
[null,null,"Voor verblijftijd en bodemweerstand wordt een risico aangeduid op een schaal van drie (laag, midden, hoog).",null,null,null,null,null,null,null,null,null,null,null,null,null,null,null,1]
[null,null,"Voor brakke kwel, land-water contact en bevloeiing wordt een risico aangeduid op een schaal van twee (laag, hoog).",null,null,null,null,null,null,null,null,null,null,null,null,null,null,null,1]
[null,null,null,null,null,null,null,null,null,null,null,null,null,null,null,null,null,null,1]
[null,null,"N.B.: er wordt aangenomen dat deze parameters voor alle geselecteerde beheertypen en habitattypen gelden. Er is geen mogelijkheid om deze waardes per type te bepalen.",null,null,null,null,null,null,null,null,null,null,null,null,null,null,null,1]
[null,null,null,null,null,null,null,null,null,null,null,null,null,null,null,null,null,null,1]
[null,null,null,null,null,null,null,null,null,null,null,null,null,null,null,null,null,null,1]
[null,null,"1. Verblijftijd",null,"Risico",null,null,null,null,null,null,null,null,null,null,null,null,null,1]
[null,null,null,null,null,null,null,null,null,null,null,null,null,null,null,null,null,null,1]
[null,null,{"$f":"IF(verblijftijd<>\"\",_xlfn.CONCAT(\"Risico t.a.v. de verblijftijd (\", verblijftijd,\" dagen)\"),\"Nog geen verblijftijd gekozen (zie tabblad 1. Algemeen).\")","v":"Nog geen verblijftijd gekozen (zie tabblad 1. Algemeen)."},null,{"$f":"IF(verblijftijd=Invoer!F4,\"laag\",IF(verblijftijd=Invoer!F5,\"midden\",IF(verblijftijd=Invoer!F6,\"hoog\",\"-\")))","v":"-"},null,null,null,null,null,null,null,null,null,null,null,null,null,1]
[null,null,"N.B. hoe korter de verblijftijd, hoe minder groot de verwachte effecten zullen zijn.",null,null,null,null,null,null,null,null,null,null,null,null,null,null,null,1]
[null,null,null,null,null,null,null,null,null,null,null,null,null,null,null,null,null,null,1]
[null,null,"2. Brakke kwel",null,null,null,null,null,null,null,null,null,null,null,null,null,null,null,1]
[null,null,null,null,null,null,null,null,null,null,null,null,null,null,null,null,null,null,1]
[null,null,{"$f":"IF(bool_brakke_kwel=\"Ja\",\"Gevoeligheid t.a.v. het WEL kunnen optreden van brakke kwel.\",IF(bool_brakke_kwel=\"Nee\",\"Gevoeligheid t.a.v. het NIET kunnen optreden van brakke kwel.\",\"Nog geen keuze gemaakt over brakke kwel (zie tabblad 4. Terrestrisch).\"))","v":"Nog geen keuze gemaakt over brakke kwel (zie tabblad 4. Terrestrisch)."},null,{"$f":"IF(bool_brakke_kwel=\"Ja\",\"hoog\",IF(bool_brakke_kwel=\"Nee\",\"laag\",\"-\"))","v":"-"},null,"voor zoete habitat- en beheertypen",null,null,null,null,null,null,null,null,null,null,null,1]
[null,null,"N.B. wateren die brakke kwel ervaren bij een neerslagtekort, inlaattekort of een lager ",null,{"$f":"IF(bool_brakke_kwel=\"Ja\",\"laag\",IF(bool_brakke_kwel=\"Nee\",\"hoog\",\"-\"))","v":"-"},null,"voor zilte habitattypen",null,null,null,null,null,null,null,null,null,null,null,1]
[null,null,"gehanteerd peil zijn meer gevoelig voor verzilting.",null,null,null,null,null,null,null,null,null,null,null,null,null,null,null,1]
[]
[null,null,"3. Land-water contact",null,null,null,null,null,null,null,null,null,null,null,null,null,null,null,1]
[null,null,null,null,null,null,null,null,null,null,null,null,null,null,null,null,null,null,1]
[null,null,{"$f":"IF(bool_slootdichtheid=\"Hoog\",\"Gevoeligheid t.a.v. veel sloten.\",IF(bool_slootdichtheid=\"Laag\",\"Gevoeligheid t.a.v. weinig sloten.\",\"Nog geen keuze gemaakt over slootdichtheid (zie tabblad 4. Terrestrisch).\"))","v":"Nog geen keuze gemaakt over slootdichtheid (zie tabblad 4. Terrestrisch)."},null,{"$f":"IF(bool_slootdichtheid<>\"\",IF(bool_slootdichtheid=\"hoog\",\"hoog\",\"laag\"),\"-\")","v":"-"},null,null,null,null,null,null,null,null,null,null,null,null,null,1]
[null,null,"N.B. hoe meer sloten, hoe groter het contact tussen water en perceel.",null,null,null,null,null,null,null,null,null,null,null,null,null,null,null,1]
[null,null,null,null,null,null,null,null,null,null,null,null,null,null,null,null,null,null,1]
[null,null,"4. Bodemweerstand",null,null,null,null,null,null,null,null,null,null,null,null,null,null,null,1]
[null,null,null,null,null,null,null,null,null,null,null,null,null,null,null,null,null,null,1]
[null,null,{"$f":"IF(bodemtype<>\"\",_xlfn.CONCAT(\"Risico t.a.v. de hydraulische weerstand van de bodem (\", bodemtype,\").\"),\"nog geen bodemtype gekozen (zie tabblad 1. Algemeen).\")","v":"nog geen bodemtype gekozen (zie tabblad 1. Algemeen)."},null,{"$f":"IF(bodemtype=Invoer!B8,\"hoog\",IF(OR(bodemtype=Invoer!B7, bodemtype=Invoer!B6),\"midden\", IF(OR(bodemtype=Invoer!B5, bodemtype=Invoer!B4),\"laag\",\"-\")))","v":"-"},null,null,null,null,null,null,null,null,null,null,null,null,null,1]
[null,null,"N.B. een mate voor hoe gemakkelijk water via de oever het perceel kan intrekken. Hoe kleiiger/veniger de bodem, hoe moeilijker dit gaat.",null,null,null,null,null,null,null,null,null,null,null,null,null,null,null,1]
[null,null,null,null,null,null,null,null,null,null,null,null,null,null,null,null,null,null,1]
[null,null,"5. Bevloeiing",null,null,null,null,null,null,null,null,null,null,null,null,null,null,null,1]
[null,null,null,null,null,null,null,null,null,null,null,null,null,null,null,null,null,null,1]
[null,null,{"$f":"IF(bool_bevloeiing=\"Ja\",\"Gevoeligheid t.a.v. noodzaak voor bevloeiing.\",IF(bool_bevloeiing=\"Nee\",\"Gevoeligheid t.a.v. GEEN noodzaak voor bevloeiing.\",\"Nog geen keuze gemaakt over noodzaak bevloeiing (zie tabblad 4. Terrestrisch).\"))","v":"Nog geen keuze gemaakt over noodzaak bevloeiing (zie tabblad 4. Terrestrisch)."},null,{"$f":"IF(OR(ISNUMBER(MATCH('Grenswaarden Terrestrisch'!A33,C14:C34,0)),ISNUMBER(MATCH('Grenswaarden Terrestrisch'!A56,C14:C34,0))),IF(bool_bevloeiing=\"Ja\",\"hoog\",\"laag\"),\nIF(OR(ISNUMBER(MATCH('Grenswaarden Terrestrisch'!A10,C14:C34,0)),ISNUMBER(MATCH('Grenswaarden Terrestrisch'!A39,C14:C34,0))),IF(bool_bevloeiing=\"Nee\",\"hoog\",\"laag\"),\"-\"))","v":"-"},null,null,null,null,null,null,null,null,null,null,null,null,null,1]
[null,null,"N.B. deze vraag is alleen relevant voor N10.01, N12.04, H6410 en H1330_B. Voor alle andere typen zijn indifferent op dit onderdeel.",null,null,null,null,null,null,null,null,null,null,null,null,null,null,null,1]
[null,null,null,null,null,null,null,null,null,null,null,null,null,null,null,null,null,null,1]
[null,null,"Conclusie",null,null,null,null,null,null,null,null,null,null,null,null,null,null,null,1]
[null,null,"De som van bovenstaande vijf omgevingsfactoren resulteert in het volgende risico:",null,{"$f":"IF(OR(E57=\"hoog\", E62=\"hoog\", E68=\"hoog\", E73=\"hoog\", E78=\"hoog\"), \"hoog\",\n   IF(OR(E57=\"midden\", E62=\"midden\", E68=\"midden\", E73=\"midden\", E78=\"midden\"), \"midden\",\n   IF(OR(E57=\"laag\", E62=\"laag\", E68=\"laag\", E73=\"laag\", E78=\"laag\"), \"laag\",\n   \"-\")))","v":"-"},null,"voor zoete habitat- en beheertypen",null,null,null,null,null,null,null,null,null,null,null,1]
[null,null,"N.B. Hierbij geldt het principe one-out-all-out (het hoogste risico prevaleert).",null,{"$f":"IF(OR(E57=\"hoog\", E63=\"hoog\", E68=\"hoog\", E73=\"hoog\", E78=\"hoog\"), \"hoog\",\n   IF(OR(E57=\"midden\", E63=\"midden\", E68=\"midden\", E73=\"midden\", E78=\"midden\"), \"midden\",\n   IF(OR(E57=\"laag\", E63=\"laag\", E68=\"laag\", E73=\"laag\", E78=\"laag\"), \"laag\",\n   \"-\")))","v":"-"},null,"voor zilte habitattypen",null,null,null,null,null,null,null,null,null,null,null,1]
[null,null,null,null,null,null,null,null,null,null,null,null,null,null,null,null,null,null,1]
[null,null,null,null,null,null,null,null,null,null,null,null,null,null,null,null,null,null,{"$f":"IF($R$87=2,0,1)","v":1}]
["BLOK 3: ABIOTIEK VERSTORING\n- TOEKOMSTIGE SITUATIE -",null,null,null,null,null,null,null,null,null,null,null,null,null,null,null,null,null,{"$f":"IF($R$87=2,0,1)","v":1}]
[null,null,{"$f":"IF(bool_toets_verstoring=\"Ja - verstoring\",\"Oordeelsblok 3: zoutgehalte verstoring (toekomstige situatie)\",IF(bool_toets_verstoring=\"Ja - fysieke ingreep\",\"Oordeelsblok 3: zoutgehalte fysieke ingreep (toekomstige situatie)\",\"Oordeelsblok 3: zoutgehalte verstoring of fysieke ingreep (toekomstige situatie)\"))","v":"Oordeelsblok 3: zoutgehalte verstoring of fysieke ingreep (toekomstige situatie)"},null,null,null,null,null,null,null,null,null,null,null,null,null,null,{"$f":"IF(bool_toets_verstoring=\"Ja - verstoring\",1,IF(bool_toets_verstoring=\"Ja - fysieke ingreep\",2,0))","v":0},{"$f":"IF($R$87=2,0,1)","v":1}]
[null,null,null,null,null,null,null,null,null,null,null,null,null,null,null,null,null,null,{"$f":"IF($R$87=2,0,1)","v":1}]
[null,null,{"$f":"IF(R87=1,\"In dit blok wordt het risico bepaald voor het zoutgehalte t.g.v. een verstoring in de toekomstige situatie.\",\"U heeft niet gekozen om een verstoring/fysieke ingreep te toetsen. Daarom wordt hier geen beoordeling opgesteld.\")","v":"U heeft niet gekozen om een verstoring/fysieke ingreep te toetsen. Daarom wordt hier geen beoordeling opgesteld."},null,null,null,null,null,null,null,null,null,null,null,null,null,null,{"$f":"IF(bool_toets_verstoring=\"Ja - verstoring\",1,0)","v":0},{"$f":"IF($R$87=2,0,1)","v":1}]
[null,null,"Hierbij wordt gebruik gemaakt van de gebruikersoordelen van de omgevingsparameters op tabblad 4. Terrestrisch.",null,null,null,null,null,null,null,null,null,null,null,null,null,null,null,{"$f":"$R$89","v":0}]
[null,null,"Alleen de concentratie van het zoutgehalte wordt hier gebruikt om een verdiepend oordeel te geven. De rest van de omgevingsparameters zijn belangrijk om mee te nemen in de eindbeoordeling.",null,null,null,null,null,null,null,null,null,null,null,null,null,null,null,{"$f":"$R$89","v":0}]
[null,null,null,null,null,null,null,null,null,null,null,null,null,null,null,null,null,null,0]
[null,null,"Eigenschappen zoutpuls",null,null,null,null,null,null,null,null,null,null,null,null,null,null,null,0]
[null,null,{"$f":"_xlfn.CONCAT(\"Gemiddelde duur (\", verstoring_duur,\" dagen)\")","v":"Gemiddelde duur ( dagen)"},null,{"$f":"IF(AND('4. Terrestrisch'!D70<>\"\",$R$87=1),'4. Terrestrisch'!D70,\"niet opgegeven\")","v":"niet opgegeven"},null,null,null,null,null,null,null,null,null,null,null,null,null,0]
[null,null,{"$f":"_xlfn.CONCAT(\"Frequentie (\", verstoring_frequentie,\" keer per jaar)\")","v":"Frequentie ( keer per jaar)"},null,{"$f":"IF(AND('4. Terrestrisch'!D71<>\"\",$R$87=1),'4. Terrestrisch'!D71,\"niet opgegeven\")","v":"niet opgegeven"},null,null,null,null,null,null,null,null,null,null,null,null,null,0]
[null,null,{"$f":"_xlfn.CONCAT(\"Tijdsinterval (\", verstoring_tijdsinterval,\" dagen tussen opeenvolgende verstoringen)\")","v":"Tijdsinterval ( dagen tussen opeenvolgende verstoringen)"},null,{"$f":"IF(AND('4. Terrestrisch'!D72<>\"\",$R$87=1),'4. Terrestrisch'!D72,\"niet opgegeven\")","v":"niet opgegeven"},null,null,null,null,null,null,null,null,null,null,null,null,null,0]
[null,null,{"$f":"_xlfn.CONCAT(\"Moment (\", verstoring_moment,\")\")","v":"Moment ()"},null,{"$f":"IF(AND('4. Terrestrisch'!D73<>\"\",$R$87=1),'4. Terrestrisch'!D73,\"niet opgegeven\")","v":"niet opgegeven"},null,null,null,null,null,null,null,null,null,null,null,null,null,0]
[null,null,{"$f":"IF(eenheid_zoutgehalte_algemeen=\"Chloridegehalte\",_xlfn.CONCAT(\"Zoutgehalte (\",verstoring_zoutgehalte,\" mg Cl/l)\"),\nIF(eenheid_zoutgehalte_algemeen=\"EC-waarde\",_xlfn.CONCAT(\"Zoutgehalte (\", verstoring_zoutgehalte,\" dS/m)\"),\"eenheid onbekend\"))","v":"eenheid onbekend"},null,{"$f":"IF(AND('4. Terrestrisch'!D74<>\"\",$R$87=1),'4. Terrestrisch'!D74,\"niet opgegeven\")","v":"niet opgegeven"},null,null,null,null,null,null,null,null,null,null,null,null,null,0]
[null,null,{"$f":"_xlfn.CONCAT(\"Omvang (\", verstoring_omvang_ha,\" ha / \", verstoring_omvang_perc, \" %)\")","v":"Omvang ( ha /  %)"},null,{"$f":"IF(AND('4. Terrestrisch'!D75<>\"\",$R$87=1),'4. Terrestrisch'!D75,\"niet opgegeven\")","v":"niet opgegeven"},null,null,null,null,null,null,null,null,null,null,null,null,null,0]
[null,null,null,null,null,null,null,null,null,null,null,null,null,null,null,null,null,null,{"$f":"$R$89","v":0}]
[null,null,"Conclusie",null,null,null,null,null,null,null,null,null,null,null,null,null,null,null,{"$f":"$R$89","v":0}]
[null,null,{"$f":"IF(R87=1,\"Is de verstoring 'omvangrijk' (zie tabblad 4. Terrestrisch)?\",IF(R87=2,\"Is de fysieke ingreep omvangrijk?\",\"\"))","v":""},null,{"$f":"IF(R87=1,IF(COUNTIF('4. Terrestrisch'!$D$74:$E$74, \"Omvangrijk\")>0,\"Ja\",IF(COUNTIF('4. Terrestrisch'!$D$74:$E$74, \"Niet omvangrijk\")>0,\"Nee\",\"niet genoeg gegevens\")),\"-\")","v":"-"},null,null,null,null,null,null,null,null,null,null,null,null,null,{"$f":"$R$89","v":0}]
[null,null,"N.B. in de huidige versie van het afwegingskader wordt alleen de eigenschap 'concentratie' gebruikt voor de conclusie of de verstoring 'omvangrijk' is door gebrek aan kennis.",null,null,null,null,null,null,null,null,null,null,null,null,null,null,null,{"$f":"$R$89","v":0}]
[null,null,null,null,null,null,null,null,null,null,null,null,null,null,null,null,null,null,{"$f":"IF($R$87=2,0,1)","v":1}]
[null,null,null,null,null,null,null,null,null,null,null,null,null,null,null,null,null,null,1]
["BLOK 3: ABIOTIEK FYSIEKE INGREEP\n- TOEKOMSTIGE SITUATIE -",null,null,null,null,null,null,null,null,null,null,null,null,null,null,null,null,null,{"$f":"$R$107","v":0}]
[null,null,"Oordeelsblok 3: biotische gevoeligheid zoutgehalte fysieke ingreep",null,null,null,null,null,null,null,"N.B.: De huidige situatie wordt beoordeeld in BLOK 1 & 2.",null,null,null,null,null,null,{"$f":"IF(bool_toets_verstoring=\"Ja - fysieke ingreep\",1,0)","v":0},{"$f":"$R$107","v":0}]
[null,null,null,null,null,null,null,null,null,null,null,null,null,null,null,null,null,null,0]
[null,null,"In dit blok wordt het risico bepaald voor het zoutgehalte t.g.v. een fysieke ingreep in de toekomstige situatie.",null,null,null,null,null,null,null,null,null,null,null,null,null,null,null,0]
[null,null,"Om uitvoer te zien, dient u te hebben aangegeven welk(e) habitat-/beheertype(n) u wilt doorlichten, wat de huidige staat van kwaliteit is en met welke zouteenheid (EC of chloride) u rekent.",null,null,null,null,null,null,null,null,null,null,null,null,null,null,null,0]
[null,null,"Voor het maken van de risicobepaling, wordt het zoutgehalte van het oppervlaktewater vergeleken met de grenswaarden voor verzilting en verzoeting van de ingevoerde habitattypen en beheertypen. ",null,null,null,null,null,null,null,null,null,null,null,null,null,null,null,0]
[null,null,null,null,null,null,null,null,null,null,null,null,null,null,null,null,null,null,0]
[null,null,{"$f":"IF(eenheid_zoutgehalte_algemeen<>\"\",_xlfn.CONCAT(\"De eenheid van het zoutgehalte die door u is opgegeven, is: \"),\n\"De eenheid van het zoutgehalte is nog niet opgegeven. Het is nog niet mogelijk risico's in te schatten.\")","v":"De eenheid van het zoutgehalte is nog niet opgegeven. Het is nog niet mogelijk risico's in te schatten."},null,{"$f":"IF(eenheid_zoutgehalte_algemeen=\"\",\"onbekend\", eenheid_zoutgehalte_algemeen)","v":"onbekend"},null,"Maximaal zoutgehalte:",null,{"$f":"IF(R113=1,165*maximaal_zoutgehalte_ingreep^1.3438,maximaal_zoutgehalte_ingreep)","v":0},"mg Cl/l",null,null,null,null,null,null,null,{"$f":"IF(E113=\"EC-waarde\",1,IF(E113=\"Chloridegehalte\",2,0))","v":0},0]
[null,null,{"$f":"IF(R113=1,\"De ingevulde EC waardes worden voor de functie terrestrische natuur omgerekend naar chloridegehaltes.\",\"\")","v":""},null,null,null,"Minimaal zoutgehalte:",null,{"$f":"IF(R113=1,165*minimaal_zoutgehalte_ingreep^1.3438,minimaal_zoutgehalte_ingreep)","v":0},"mg Cl/l",null,null,null,null,null,null,null,null,0]
[null,null,"NNN beheertypen",null,null,null,null,null,null,null,null,null,null,null,null,null,null,null,0]
[null,null,"Het risico wordt voornamelijk bepaald door de zouttolerantie (gevoelig = hoog, matig tolerant = midden, tolerant = laag) en wordt bijgesteld naar 'hoog' als de grenswaarde wordt overschreden.",null,null,null,null,null,null,null,null,null,null,null,null,null,null,null,0]
[null,null,"Geselecteerde beheertypen",null,"Zouttolerantie",null,null,null,"Grenswaarde zout (mg Cl/l)",null,"Grenswaarde overschreden?",null,"Risico voor verzilting",null,null,null,null,null,0]
[null,null,{"$f":"_xlfn._xlws.FILTER('4. Terrestrisch'!C10:C37,'4. Terrestrisch'!E10:E37=1,\"… nog geen beheertypen geselecteerd op tabblad 4. Terrestrisch ...\")","v":"… nog geen beheertypen geselecteerd op tabblad 4. Terrestrisch ..."},null,{"$f":"IF(C118<>\"\",_xlfn.XLOOKUP(C118,'Grenswaarden Terrestrisch'!$A$5:$A$33,'Grenswaarden Terrestrisch'!$F$5:$F$33,\"\"))","v":""},null,null,null,{"$f":"IF(C118<>\"\",_xlfn.XLOOKUP(C118,'Grenswaarden Terrestrisch'!$A$5:$A$33,'Grenswaarden Terrestrisch'!$D$5:$D$33,\"\"),\"\")","v":""},null,{"$f":"IF(SUM('4. Terrestrisch'!$E$10:$E$37)>0,IF($I$113=0,\"-\",IF(I118<=$I$113,\"Ja\",\"Nee\")),\"\")","v":""},null,{"$f":"IF(K118=\"-\",\"-\",IF(K118=\"Ja\",\"hoog\",IF(E118=\"tolerant\",\"laag\",IF(E118=\"matig tolerant\",\"midden\",IF(E118=\"gevoelig\",\"hoog\",\"\")))))","v":""},null,null,null,null,null,{"$f":"IF(AND(C118<>\"\",$R$107=1),1,0)","v":0}]
[null,null,null,null,{"$f":"IF(C119<>\"\",_xlfn.XLOOKUP(C119,'Grenswaarden Terrestrisch'!$A$5:$A$33,'Grenswaarden Terrestrisch'!$F$5:$F$33,\"\"),\"\")","v":""},null,null,null,{"$f":"IF(C119<>\"\",_xlfn.XLOOKUP(C119,'Grenswaarden Terrestrisch'!$A$5:$A$33,'Grenswaarden Terrestrisch'!$D$5:$D$33,\"\"),\"\")","v":""},null,{"$f":"IF(SUM('4. Terrestrisch'!$E$10:$E$37)>0,IF($I$113=0,\"-\",IF(I119<=$I$113,\"Ja\",\"Nee\")))","v":false},null,{"$f":"IF(K119=\"-\",\"-\",IF(K119=\"Ja\",\"hoog\",IF(E119=\"tolerant\",\"laag\",IF(E119=\"matig tolerant\",\"midden\",IF(E119=\"gevoelig\",\"hoog\",\"\")))))","v":""},null,null,null,null,null,{"$f":"IF(AND(C119<>\"\",$R$107=1),1,0)","v":0}]
[null,null,null,null,{"$f":"IF(C120<>\"\",_xlfn.XLOOKUP(C120,'Grenswaarden Terrestrisch'!$A$5:$A$33,'Grenswaarden Terrestrisch'!$F$5:$F$33,\"\"),\"\")","v":""},null,null,null,{"$f":"IF(C120<>\"\",_xlfn.XLOOKUP(C120,'Grenswaarden Terrestrisch'!$A$5:$A$33,'Grenswaarden Terrestrisch'!$D$5:$D$33,\"\"),\"\")","v":""},null,{"$f":"IF(SUM('4. Terrestrisch'!$E$10:$E$37)>0,IF($I$113=0,\"-\",IF(I120<=$I$113,\"Ja\",\"Nee\")))","v":false},null,{"$f":"IF(K120=\"-\",\"-\",IF(K120=\"Ja\",\"hoog\",IF(E120=\"tolerant\",\"laag\",IF(E120=\"matig tolerant\",\"midden\",IF(E120=\"gevoelig\",\"hoog\",\"\")))))","v":""},null,null,null,null,null,{"$f":"IF(AND(C120<>\"\",$R$107=1),1,0)","v":0}]
[null,null,null,null,{"$f":"IF(C121<>\"\",_xlfn.XLOOKUP(C121,'Grenswaarden Terrestrisch'!$A$5:$A$33,'Grenswaarden Terrestrisch'!$F$5:$F$33,\"\"),\"\")","v":""},null,null,null,{"$f":"IF(C121<>\"\",_xlfn.XLOOKUP(C121,'Grenswaarden Terrestrisch'!$A$5:$A$33,'Grenswaarden Terrestrisch'!$D$5:$D$33,\"\"),\"\")","v":""},null,{"$f":"IF(SUM('4. Terrestrisch'!$E$10:$E$37)>0,IF($I$113=0,\"-\",IF(I121<=$I$113,\"Ja\",\"Nee\")))","v":false},null,{"$f":"IF(K121=\"-\",\"-\",IF(K121=\"Ja\",\"hoog\",IF(E121=\"tolerant\",\"laag\",IF(E121=\"matig tolerant\",\"midden\",IF(E121=\"gevoelig\",\"hoog\",\"\")))))","v":""},null,null,null,null,null,{"$f":"IF(AND(C121<>\"\",$R$107=1),1,0)","v":0}]
[null,null,null,null,{"$f":"IF(C122<>\"\",_xlfn.XLOOKUP(C122,'Grenswaarden Terrestrisch'!$A$5:$A$33,'Grenswaarden Terrestrisch'!$F$5:$F$33,\"\"),\"\")","v":""},null,null,null,{"$f":"IF(C122<>\"\",_xlfn.XLOOKUP(C122,'Grenswaarden Terrestrisch'!$A$5:$A$33,'Grenswaarden Terrestrisch'!$D$5:$D$33,\"\"),\"\")","v":""},null,{"$f":"IF(SUM('4. Terrestrisch'!$E$10:$E$37)>0,IF($I$113=0,\"-\",IF(I122<=$I$113,\"Ja\",\"Nee\")))","v":false},null,{"$f":"IF(K122=\"-\",\"-\",IF(K122=\"Ja\",\"hoog\",IF(E122=\"tolerant\",\"laag\",IF(E122=\"matig tolerant\",\"midden\",IF(E122=\"gevoelig\",\"hoog\",\"\")))))","v":""},null,null,null,null,null,{"$f":"IF(AND(C122<>\"\",$R$107=1),1,0)","v":0}]
[null,null,null,null,null,null,{"$f":"IF(E123=\"tolerant\",\"laag\",IF(E123=\"matig tolerant\",\"midden\",IF(E123=\"gevoelig\",\"hoog\",\"\")))","v":""},null,null,null,null,null,null,null,null,null,null,null,{"$f":"$R$107","v":0},{"$f":"SUM(S118:S122)","v":0}]
[null,null,"N2000 Habitattypen",null,null,null,{"$f":"IF(E124=\"tolerant\",\"laag\",IF(E124=\"matig tolerant\",\"midden\",IF(E124=\"gevoelig\",\"hoog\",\"\")))","v":""},null,null,null,null,null,null,null,null,null,null,null,{"$f":"$R$107","v":0}]
[null,null,"Het risico wordt bepaald door de zouttolerantie (idem als NNN beheertypen) en wordt bijgesteld naar 'hoog' als de grenswaarde wordt overschreden. Als de staat van kwaliteit slecht/onbekend is, wordt het risico met één niveau verhoogd.",null,null,null,null,null,null,null,null,null,null,null,null,null,null,null,{"$f":"$R$107","v":0}]
[null,null,"Verzoeting:",null,null,null,null,null,null,null,null,null,null,null,null,null,null,null,{"$f":"$R$107","v":0}]
[null,null,"Geselecteerde habitattypen",null,"Zouttolerantie",null,"Staat van kwaliteit",null,"Grenswaarde zoet (mg Cl/l)",null,"Grenswaarde onderschreden?",null,"Risico voor verzoeting",null,null,null,null,null,{"$f":"$R$107","v":0}]
[null,null,{"$f":"_xlfn._xlws.FILTER('4. Terrestrisch'!I10:I11,'4. Terrestrisch'!K10:K11=1,\"… nog geen habitattypen geselecteerd die te maken kunnen krijgen met verzoeting…\")","v":"… nog geen habitattypen geselecteerd die te maken kunnen krijgen met verzoeting…"},null,{"$f":"_xlfn.XLOOKUP(C128,'Grenswaarden Terrestrisch'!$A$38:$A$39,'Grenswaarden Terrestrisch'!$F$38:$F$39,\"\")","v":""},null,{"$f":"_xlfn.XLOOKUP(C128,'4. Terrestrisch'!$I$10:$I$34,'4. Terrestrisch'!$M$10:$M$34,\"-\")","v":"-"},null,{"$f":"IF(C128<>\"\",_xlfn.XLOOKUP(C128,'Grenswaarden Terrestrisch'!$A$38:$A$62,'Grenswaarden Terrestrisch'!$B$38:$B$62,\"\"),\"\")","v":""},null,{"$f":"IF(SUM('4. Terrestrisch'!$K$10:$K$11)>0,IF($I$114=0,\"-\",IF(I128>=$I$114,\"Ja\",\"Nee\")),\"\")","v":""},null,{"$f":"IF(SUM('4. Terrestrisch'!$K$10:$K$11)>0,IF(K128=\"-\",\"-\",IF(K128=\"Ja\",\"hoog\",IF(E128=\"tolerant\",IF(OR(G128=\"slecht\",G128=\"onbekend\"),\"midden\",\"laag\"),\nIF(E128=\"matig tolerant\",IF(OR(G128=\"slecht\",G128=\"onbekend\"),\"hoog\",\"midden\"),\nIF(E128=\"gevoelig\",\"hoog\"))))),\"\")","v":""},null,null,null,null,null,{"$f":"IF(AND(C128<>\"\",$R$107=1),1,0)","v":0}]
[null,null,null,null,{"$f":"_xlfn.XLOOKUP(C129,'Grenswaarden Terrestrisch'!$A$38:$A$39,'Grenswaarden Terrestrisch'!$F$38:$F$39,\"\")","v":""},null,{"$f":"_xlfn.XLOOKUP(C129,'4. Terrestrisch'!$I$10:$I$34,'4. Terrestrisch'!$M$10:$M$34,\"-\")","v":"-"},null,{"$f":"IF(C129<>\"\",_xlfn.XLOOKUP(C129,'Grenswaarden Terrestrisch'!$A$38:$A$62,'Grenswaarden Terrestrisch'!$B$38:$B$62,\"\"),\"\")","v":""},null,{"$f":"IF(SUM('4. Terrestrisch'!$K$10:$K$11)>0,IF($I$114=0,\"-\",IF(I129>=$I$114,\"Ja\",\"Nee\")))","v":false},null,{"$f":"IF(SUM('4. Terrestrisch'!$K$10:$K$11)>0,IF(K129=\"-\",\"-\",IF(K129=\"Ja\",\"hoog\",IF(E129=\"tolerant\",IF(OR(G129=\"slecht\",G129=\"onbekend\"),\"midden\",\"laag\"),\nIF(E129=\"matig tolerant\",IF(OR(G129=\"slecht\",G129=\"onbekend\"),\"hoog\",\"midden\"),\nIF(E129=\"gevoelig\",\"hoog\"))))))","v":false},null,null,null,null,null,{"$f":"IF(AND(C129<>\"\",$R$107=1),1,0)","v":0}]
[null,null,null,null,null,null,null,null,null,null,null,null,null,null,null,null,null,null,{"$f":"$R$107","v":0},{"$f":"SUM(S128:S129)","v":0}]
[null,null,"Verzilting:",null,null,null,null,null,null,null,null,null,null,null,null,null,null,null,{"$f":"$R$107","v":0}]
[null,null,"Geselecteerde habitattypen",null,"Zouttolerantie",null,"Staat van kwaliteit",null,"Grenswaarde zout (mg Cl/l)",null,"Grenswaarde overschreden?",null,"Risico voor verzilting",null,null,null,null,null,{"$f":"$R$107","v":0}]
[null,null,{"$f":"_xlfn._xlws.FILTER('4. Terrestrisch'!I12:I34,'4. Terrestrisch'!K12:K34,\"… nog geen habitattypen geselecteerd die te maken kunnen krijgen met verzilting …\")","v":"… nog geen habitattypen geselecteerd die te maken kunnen krijgen met verzilting …"},null,{"$f":"_xlfn.XLOOKUP(C133,'Grenswaarden Terrestrisch'!$A$40:$A$62,'Grenswaarden Terrestrisch'!$F$40:$F$62,\"\")","v":""},null,{"$f":"_xlfn.XLOOKUP(C133,'4. Terrestrisch'!$I$10:$I$34,'4. Terrestrisch'!$M$10:$M$34,\"-\")","v":"-"},null,{"$f":"IF(C133<>\"\",_xlfn.XLOOKUP(C133,'Grenswaarden Terrestrisch'!$A$38:$A$62,'Grenswaarden Terrestrisch'!$D$38:$D$62,\"\"),\"\")","v":""},null,{"$f":"IF(SUM('4. Terrestrisch'!$K$12:$K$34)>0,IF($I$113=0,\"-\",IF(I133<=$I$113,\"Ja\",\"Nee\")),\"\")","v":""},null,{"$f":"IF(K133=\"Ja\",\"hoog\",IF(SUM('4. Terrestrisch'!$K$12:$K$34)>0,IF($I$113=0,\"-\",IF(E133=\"tolerant\",IF(OR(G133=\"slecht\",G133=\"onbekend\"),\"midden\",\"laag\"),\nIF(E133=\"matig tolerant\",IF(OR(G133=\"slecht\",G133=\"onbekend\"),\"hoog\",\"midden\"),\nIF(E133=\"gevoelig\",\"hoog\")))),\"\"))","v":""},null,null,null,null,null,{"$f":"IF(AND(C133<>\"\",$R$107=1),1,0)","v":0}]
[null,null,null,null,{"$f":"_xlfn.XLOOKUP(C134,'Grenswaarden Terrestrisch'!$A$40:$A$62,'Grenswaarden Terrestrisch'!$F$40:$F$62,\"\")","v":""},null,{"$f":"_xlfn.XLOOKUP(C134,'4. Terrestrisch'!$I$10:$I$34,'4. Terrestrisch'!$M$10:$M$34,\"-\")","v":"-"},null,{"$f":"IF(C134<>\"\",_xlfn.XLOOKUP(C134,'Grenswaarden Terrestrisch'!$A$38:$A$62,'Grenswaarden Terrestrisch'!$D$38:$D$62,\"\"),\"\")","v":""},null,{"$f":"IF(SUM('4. Terrestrisch'!$K$12:$K$34)>0,IF($I$113=0,\"-\",IF(I134<=$I$113,\"Ja\",\"Nee\")))","v":false},null,{"$f":"IF(K134=\"Ja\",\"hoog\",IF(SUM('4. Terrestrisch'!$K$12:$K$34)>0,IF($I$113=0,\"-\",IF(E134=\"tolerant\",IF(OR(G134=\"slecht\",G134=\"onbekend\"),\"midden\",\"laag\"),\nIF(E134=\"matig tolerant\",IF(OR(G134=\"slecht\",G134=\"onbekend\"),\"hoog\",\"midden\"),\nIF(E134=\"gevoelig\",\"hoog\"))))))","v":false},null,null,null,null,null,{"$f":"IF(AND(C134<>\"\",$R$107=1),1,0)","v":0}]
[null,null,null,null,{"$f":"_xlfn.XLOOKUP(C135,'Grenswaarden Terrestrisch'!$A$40:$A$62,'Grenswaarden Terrestrisch'!$F$40:$F$62,\"\")","v":""},null,{"$f":"_xlfn.XLOOKUP(C135,'4. Terrestrisch'!$I$10:$I$34,'4. Terrestrisch'!$M$10:$M$34,\"-\")","v":"-"},null,{"$f":"IF(C135<>\"\",_xlfn.XLOOKUP(C135,'Grenswaarden Terrestrisch'!$A$38:$A$62,'Grenswaarden Terrestrisch'!$D$38:$D$62,\"\"),\"\")","v":""},null,{"$f":"IF(SUM('4. Terrestrisch'!$K$12:$K$34)>0,IF($I$113=0,\"-\",IF(I135<=$I$113,\"Ja\",\"Nee\")))","v":false},null,{"$f":"IF(K135=\"Ja\",\"hoog\",IF(SUM('4. Terrestrisch'!$K$12:$K$34)>0,IF($I$113=0,\"-\",IF(E135=\"tolerant\",IF(OR(G135=\"slecht\",G135=\"onbekend\"),\"midden\",\"laag\"),\nIF(E135=\"matig tolerant\",IF(OR(G135=\"slecht\",G135=\"onbekend\"),\"hoog\",\"midden\"),\nIF(E135=\"gevoelig\",\"hoog\"))))))","v":false},null,null,null,null,null,{"$f":"IF(AND(C135<>\"\",$R$107=1),1,0)","v":0}]
[null,null,null,null,{"$f":"_xlfn.XLOOKUP(C136,'Grenswaarden Terrestrisch'!$A$40:$A$62,'Grenswaarden Terrestrisch'!$F$40:$F$62,\"\")","v":""},null,{"$f":"_xlfn.XLOOKUP(C136,'4. Terrestrisch'!$I$10:$I$34,'4. Terrestrisch'!$M$10:$M$34,\"-\")","v":"-"},null,{"$f":"IF(C136<>\"\",_xlfn.XLOOKUP(C136,'Grenswaarden Terrestrisch'!$A$38:$A$62,'Grenswaarden Terrestrisch'!$D$38:$D$62,\"\"),\"\")","v":""},null,{"$f":"IF(SUM('4. Terrestrisch'!$K$12:$K$34)>0,IF($I$113=0,\"-\",IF(I136<=$I$113,\"Ja\",\"Nee\")))","v":false},null,{"$f":"IF(K136=\"Ja\",\"hoog\",IF(SUM('4. Terrestrisch'!$K$12:$K$34)>0,IF($I$113=0,\"-\",IF(E136=\"tolerant\",IF(OR(G136=\"slecht\",G136=\"onbekend\"),\"midden\",\"laag\"),\nIF(E136=\"matig tolerant\",IF(OR(G136=\"slecht\",G136=\"onbekend\"),\"hoog\",\"midden\"),\nIF(E136=\"gevoelig\",\"hoog\"))))))","v":false},null,null,null,null,null,{"$f":"IF(AND(C136<>\"\",$R$107=1),1,0)","v":0}]
[null,null,null,null,{"$f":"_xlfn.XLOOKUP(C137,'Grenswaarden Terrestrisch'!$A$40:$A$62,'Grenswaarden Terrestrisch'!$F$40:$F$62,\"\")","v":""},null,{"$f":"_xlfn.XLOOKUP(C137,'4. Terrestrisch'!$I$10:$I$34,'4. Terrestrisch'!$M$10:$M$34,\"-\")","v":"-"},null,{"$f":"IF(C137<>\"\",_xlfn.XLOOKUP(C137,'Grenswaarden Terrestrisch'!$A$38:$A$62,'Grenswaarden Terrestrisch'!$D$38:$D$62,\"\"),\"\")","v":""},null,{"$f":"IF(SUM('4. Terrestrisch'!$K$12:$K$34)>0,IF($I$113=0,\"-\",IF(I137<=$I$113,\"Ja\",\"Nee\")))","v":false},null,{"$f":"IF(K137=\"Ja\",\"hoog\",IF(SUM('4. Terrestrisch'!$K$12:$K$34)>0,IF($I$113=0,\"-\",IF(E137=\"tolerant\",IF(OR(G137=\"slecht\",G137=\"onbekend\"),\"midden\",\"laag\"),\nIF(E137=\"matig tolerant\",IF(OR(G137=\"slecht\",G137=\"onbekend\"),\"hoog\",\"midden\"),\nIF(E137=\"gevoelig\",\"hoog\"))))))","v":false},null,null,null,null,null,{"$f":"IF(AND(C137<>\"\",$R$107=1),1,0)","v":0}]
[null,null,null,null,{"$f":"_xlfn.XLOOKUP(C138,'Grenswaarden Terrestrisch'!$A$40:$A$62,'Grenswaarden Terrestrisch'!$F$40:$F$62,\"\")","v":""},null,{"$f":"_xlfn.XLOOKUP(C138,'4. Terrestrisch'!$I$10:$I$34,'4. Terrestrisch'!$M$10:$M$34,\"\")","v":""},null,{"$f":"IF(C138<>\"\",_xlfn.XLOOKUP(C138,'Grenswaarden Terrestrisch'!$A$38:$A$62,'Grenswaarden Terrestrisch'!$D$38:$D$62,\"\"),\"\")","v":""},null,null,null,{"$f":"IF(C138<>\"\",IF(E138=\"tolerant\",IF(OR(G138=\"slecht\",G138=\"onbekend\"),\"midden\",\"laag\"),\nIF(E138=\"matig tolerant\",IF(OR(G138=\"slecht\",G138=\"onbekend\"),\"hoog\",\"midden\"),\nIF(E138=\"gevoelig\",\"hoog\"))),\"\")","v":""},null,null,null,null,null,{"$f":"$R$107","v":0}]
[null,null,null,null,null,null,null,null,null,null,null,null,null,null,null,null,null,null,{"$f":"$R$107","v":0},{"$f":"SUM(S133:S138)","v":0}]
[null,null,null,null,null,null,null,null,null,null,null,null,null,null,null,null,null,null,{"$f":"$R$107","v":0}]
["BLOK 4: EINDBEPALING",null,null,null,null,null,null,null,null,null,null,null,null,null,null,null,null,null,1]
[null,null,"Oordeelsblok 4: zoutgehalte toekomstige situatie (eindbepaling)",null,null,null,null,null,null,null,null,null,null,null,null,null,null,null,1]
[null,null,null,null,null,null,null,null,null,null,null,null,null,null,null,null,null,null,1]
[null,null,"Hier worden oordeelsblokken 1, 2 en 3 gecombineerd om tot een eindbepaling te komen. Het hoogste risico is leidend.",null,null,null,null,null,null,null,null,null,null,null,null,null,null,null,1]
[null,null,{"$f":"IF(SUM('4. Terrestrisch'!E10:E37)+SUM('4. Terrestrisch'!K10:K34)=0,\"Er zijn nog geen habitat- en/of beheertypen geselecteerd (zie tabblad 4. Terrestrisch).\",\"\")","v":"Er zijn nog geen habitat- en/of beheertypen geselecteerd (zie tabblad 4. Terrestrisch)."}]
[null,null,null,null,"Natuurdoel (biotiek)",null,"Omgeving (abiotiek)",null,{"$f":"IF(bool_toets_verstoring=\"Ja - verstoring\",\"Verstoring (toekomst)\",IF(bool_toets_verstoring=\"Ja - fysieke ingreep\",\"Fysieke ingreep (toekomst)\",\"Geen verstoring getoetst\"))","v":"Geen verstoring getoetst"},null,"Eindbepaling",null,null,null,null,null,null,null,1]
[null,null,{"$f":"_xlfn._xlws.FILTER('4. Terrestrisch'!C10:C37,'4. Terrestrisch'!E10:E37=1,\"\")","v":""},null,{"$f":"M14","v":"-"},null,{"$f":"$E$82","v":"-"},null,{"$f":"IF(bool_toets_verstoring=\"Ja - verstoring\",IF($E$102=\"Nee\",\"Niet omvangrijk\",IF($E$102=\"Ja\",\"Omvangrijk\",\"onbekend\")),IF(bool_toets_verstoring=\"Ja - fysieke ingreep\",M118,\"-\"))","v":"-"},null,{"$f":"IF(OR(E147=\"-\", G147=\"-\", I147=\"-\"), \"onvoldoende gegevens\",\nIF(OR(E147=\"hoog\", G147=\"hoog\", OR(I147=\"hoog\", I147=\"Omvangrijk\")), \"hoog\",\nIF(OR(E147=\"midden\", G147=\"midden\", I147=\"midden\"), \"midden\",\nIF(OR(E147=\"laag\", G147=\"laag\", OR(I147=\"laag\", I147=\"Niet omvangrijk\")), \"laag\", \"-\"))))","v":"onvoldoende gegevens"},null,null,null,null,null,null,null,{"$f":"IF(C147<>\"\",1,0)","v":0}]
[null,null,null,null,{"$f":"M15","v":"-"},null,{"$f":"$E$82","v":"-"},null,"-",null,{"$f":"IF(OR(E148=\"-\", G148=\"-\", I148=\"-\"), \"onvoldoende gegevens\",\nIF(OR(E148=\"hoog\", G148=\"hoog\", OR(I148=\"hoog\", I148=\"Omvangrijk\")), \"hoog\",\nIF(OR(E148=\"midden\", G148=\"midden\", I148=\"midden\"), \"midden\",\nIF(OR(E148=\"laag\", G148=\"laag\", OR(I148=\"laag\", I148=\"Niet omvangrijk\")), \"laag\", \"-\"))))","v":"onvoldoende gegevens"},null,null,null,null,null,null,null,{"$f":"IF(C148<>\"\",1,0)","v":0}]
[null,null,null,null,{"$f":"M16","v":"-"},null,{"$f":"$E$82","v":"-"},null,"-",null,"onvoldoende gegevens",null,null,null,null,null,null,null,0]
[null,null,null,null,{"$f":"M17","v":"-"},null,{"$f":"$E$82","v":"-"},null,"-",null,"onvoldoende gegevens",null,null,null,null,null,null,null,0]
[null,null,null,null,{"$f":"M18","v":"-"},null,{"$f":"$E$82","v":"-"},null,"-",null,"onvoldoende gegevens",null,null,null,null,null,null,null,0]
[null,null,{"$f":"_xlfn._xlws.FILTER('4. Terrestrisch'!I10:I11,'4. Terrestrisch'!K10:K11=1,\"\")","v":""},null,{"$f":"M24","v":"-"},null,{"$f":"$E$83","v":"-"},null,"-",null,"onvoldoende gegevens",null,null,null,null,null,null,null,0]
[null,null,null,null,{"$f":"M25","v":false},null,{"$f":"$E$83","v":"-"},null,"-",null,"onvoldoende gegevens",null,null,null,null,null,null,null,0]
[null,null,{"$f":"_xlfn._xlws.FILTER('4. Terrestrisch'!I12:I34,'4. Terrestrisch'!K12:K34,\"\")","v":""},null,{"$f":"M29","v":"-"},null,{"$f":"$E$82","v":"-"},null,"-",null,"onvoldoende gegevens",null,null,null,null,null,null,null,0]
[null,null,null,null,{"$f":"M30","v":false},null,{"$f":"$E$82","v":"-"},null,"-",null,"onvoldoende gegevens",null,null,null,null,null,null,null,0]
[null,null,null,null,{"$f":"M31","v":false},null,{"$f":"$E$82","v":"-"},null,"-",null,"onvoldoende gegevens",null,null,null,null,null,null,null,0]
[null,null,null,null,{"$f":"M32","v":false},null,{"$f":"$E$82","v":"-"},null,"-",null,"onvoldoende gegevens",null,null,null,null,null,null,null,0]
[null,null,null,null,{"$f":"M33","v":false},null,{"$f":"$E$82","v":"-"},null,"-",null,"onvoldoende gegevens",null,null,null,null,null,null,null,0]
[null,null,null,null,null,null,null,null,null,null,null,null,null,null,null,null,null,null,1]
[null,null,null,null,null,null,null,null,null,null,null,null,null,null,null,null,null,null,1]
[null,null,null,null,null,null,null,null,null,null,null,null,null,null,null,null,null,null,1]
[null,null,null,null,null,null,null,null,null,null,null,null,null,null,null,null,null,null,1]

{"sheet":"Risicolegger Overig","index":10,"n_rows":6,"n_cols":3,"rows_kept":6,"cut":false,"hidden":false,"merged":[[5,2,5,11]]}
[]
[]
[null,null,"Oordeelsblok 1: Overig"]
[]
[null,null,"Neem de volgende zaken mee in de eindafweging hoe om te gaan met zoet-zout dynamiek"]
[null,null,{"$f":"IF(overig<>\"\",overig,\"Er zijn geen overige zaken opgegeven waar aanvullend rekening mee gehouden dient te worden.\")","v":"Er zijn geen overige zaken opgegeven waar aanvullend rekening mee gehouden dient te worden."}]

{"sheet":"Grenswaarden KRW","index":11,"n_rows":27,"n_cols":11,"rows_kept":27,"cut":false,"hidden":true,"merged":[]}
[]
[null,null,"Voorjaar","Zomer","Winter",null,"Kwetsbare levensfase","Sterfte soorten","Oplading waterbodem","Afname waterplanten","Voedselweb/Daphnia"]
[null,"zoet (<300 mg Cl/l)","Zeer sterk",null,null,"Mogelijk sterfte sommige soorten van zoete milieus, kwetsbare levensfase, oplading van waterbodem met zout","Ja","Ja","Ja","Nee","Nee"]
[null,"zoet (<300 mg Cl/l)",null,"Sterk",null,"Mogelijk sterfte sommige soorten van zoete milieus","Nee","Ja","Ja","Ja","Nee"]
[null,"zoet (<300 mg Cl/l)",null,"Zeer sterk",null,"Sterfte soorten van zoete milieus, effect op voedselweb (Daphnia gaat dood), oplading van waterbodem met zout","Nee","Ja","Ja","Ja","Nee"]
[null,"zoet (<300 mg Cl/l)",null,null,"Matig","Oplading van waterbodem met zout","Nee","Nee","Ja","Nee","Nee"]
[null,"zoet (<300 mg Cl/l)",null,null,"Sterk","Oplading van waterbodem met zout","Nee","Ja","Ja","Nee","Nee"]
[null,"verzoet (was brak, nu 300 - 1.000 mg Cl/l), geen zoutpieken > 1.000 mg Cl/l","Sterk",null,null,"Effect op voedselweb (Daphnia gaat dood), sterfte soorten van matig brakke milieu, kwetsbare levensfase (kieming en juveniele stadia). ","Ja","Ja","Ja","Nee","Ja"]
[null,"verzoet (was brak, nu 300 - 1.000 mg Cl/l), geen zoutpieken > 1.000 mg Cl/l","Zeer sterk",null,null,"Effect op voedselweb (Daphnia gaat dood), sterfte soorten van matig brakke milieu, kwetsbare levensfase (kieming en juveniele stadia), afname waterplanten","Ja","Ja","Ja","Ja","Ja"]
[null,"verzoet (was brak, nu 300 - 1.000 mg Cl/l), geen zoutpieken > 1.000 mg Cl/l",null,"Sterk",null,"Effect op voedselweb (Daphnia gaat dood), sterfte soorten van matig brakke milieu","Nee","Ja","Nee","Nee","Ja"]
[null,"verzoet (was brak, nu 300 - 1.000 mg Cl/l), geen zoutpieken > 1.000 mg Cl/l",null,null,"Klein","Mogelijk sterfte van sommige overwinterende soorten van matig brakke milieus","Nee","Ja","Ja","Nee","Nee"]
[null,"verzoet (was brak, nu 300 - 1.000 mg Cl/l), geen zoutpieken > 1.000 mg Cl/l",null,null,"Matig","Mogelijk sterfte overwinterende soorten van matig brakke milieus, oplading van waterbodem met zout","Nee","Ja","Ja","Nee","Nee"]
[null,"verzoet (was brak, nu 300 - 1.000 mg Cl/l), geen zoutpieken > 1.000 mg Cl/l",null,null,"Sterk","Sterfte overwinterende soorten van matig brakke milieus, oplading van waterbodem met zout","Nee","Ja","Ja","Nee","Nee"]
[null,"verzoet (was brak, nu 300 - 1.000 mg Cl/l), met zoutpieken > 1.000 mg Cl/l","Sterk",null,null,"Effect op voedselweb (Daphnia gaat dood), sterfte soorten van matig brakke milieu, kwetsbare levensfase (kieming en juveniele stadia). ","Ja","Ja","Ja","Nee","Ja"]
[null,"verzoet (was brak, nu 300 - 1.000 mg Cl/l), met zoutpieken > 1.000 mg Cl/l","Zeer sterk",null,null,"Effect op voedselweb (Daphnia gaat dood), sterfte soorten van matig brakke milieu, kwetsbare levensfase (kieming en juveniele stadia), afname waterplanten","Ja","Ja","Ja","Ja","Ja"]
[null,"verzoet (was brak, nu 300 - 1.000 mg Cl/l), met zoutpieken > 1.000 mg Cl/l",null,"Matig",null,"Mogelijk sterfte sommige soorten van matig brakke milieus","Nee","Ja","Nee","Nee","Ja"]
[null,"verzoet (was brak, nu 300 - 1.000 mg Cl/l), met zoutpieken > 1.000 mg Cl/l",null,"Sterk",null,"Sterfte sommige soorten van matig brakke milieus","Nee","Ja","Ja","Ja","Ja"]
[null,"verzoet (was brak, nu 300 - 1.000 mg Cl/l), met zoutpieken > 1.000 mg Cl/l",null,"Zeer sterk",null,"Sterfte sommige soorten van matig brakke milieus, afname waterplanten","Nee","Ja","Ja","Ja","Nee"]
[null,"verzoet (was brak, nu 300 - 1.000 mg Cl/l), met zoutpieken > 1.000 mg Cl/l",null,null,"Klein","Oplading van waterbodem met zout","Nee","Ja","Ja","Nee","Nee"]
[null,"verzoet (was brak, nu 300 - 1.000 mg Cl/l), met zoutpieken > 1.000 mg Cl/l",null,null,"Sterk","Sterfte overwinterende soorten, oplading van waterbodem met zout","Nee","Ja","Ja","Nee","Nee"]
[null,"brak (1.000 - 3.000 mg Cl/l)","Sterk",null,null,"Afname waterplanten","Ja","Nee","Ja","Ja","Nee"]
[null,"brak (1.000 - 3.000 mg Cl/l)",null,"Sterk",null,"Afname waterplanten","Nee","Nee","Ja","Ja","Nee"]
[null,"brak (1.000 - 3.000 mg Cl/l)",null,null,"Klein","Oplading van waterbodem met zout","Nee","Ja","Ja","Nee","Nee"]
[null,"brak (1.000 - 3.000 mg Cl/l)",null,null,"Matig","Sterfte overwinterende soorten, oplading van waterbodem met zout","Nee","Ja","Ja","Nee","Nee"]
[null,"brak (3.000 - 10.000 mg Cl/l)","Klein",null,null,"Niet duidelijk of alle organismen van milieu 3.000 - 10.000 mg Cl/l hiertegen kunnen","Ja","Ja","Nee","Nee","Nee"]
[null,"brak (3.000 - 10.000 mg Cl/l)",null,"Klein",null,"Niet duidelijk of alle organismen van milieu 3.000 - 10.000 mg Cl/l hiertegen kunnen (Ruppia wel)","Nee","Ja","Nee","Nee","Nee"]
[null,"brak (3.000 - 10.000 mg Cl/l)",null,null,"Klein","Oplading van waterbodem met zout","Nee","Nee","Ja","Nee","Nee"]

{"sheet":"Invoer","index":12,"n_rows":88,"n_cols":16,"rows_kept":88,"cut":false,"hidden":true,"merged":[]}
[]
[null,"INVOER ALGEMEEN"]
[null,"Bodemtype","Ontstaansgeschiedenis",null,"Aanvoer water","Verblijftijd","Peilbeheer","Eenheid zoutgehalte",null,"Verstoring",null,"Testen verstoring",null,null,"Bodemtype (helper))"]
[null,"Veen","Zoet",null,"Inlaat","< 3 dagen","Geen - vrij afstromend","EC-waarde",null,"Verzilting",null,"Nee",null,null,{"$f":"IF(B4=bodemtype,\"\",Invoer!B4)","v":"Veen"},{"$f":"_xlfn._xlws.FILTER(O4:O8,O4:O8<>\"\")","v":"Veen"}]
[null,"Klei","Brak",null,"Kwel","3 - 21 dagen","Afstromend - gestuwd","Chloridegehalte",null,"Verzoeting",null,"Ja - verstoring",null,null,{"$f":"IF(B5=bodemtype,\"\",Invoer!B5)","v":"Klei"},"Klei"]
[null,"Zavel (zwaar)",null,null,"Regen","> 21 dagen","Vast peil",null,null,null,null,"Ja - fysieke ingreep",null,null,{"$f":"IF(B6=bodemtype,\"\",Invoer!B6)","v":"Zavel (zwaar)"},"Zavel (zwaar)"]
[null,"Zavel (licht)",null,null,null,null,"Zomer- en winterpeil (natuurlijk)",null,null,null,null,null,null,null,{"$f":"IF(B7=bodemtype,\"\",Invoer!B7)","v":"Zavel (licht)"},"Zavel (licht)"]
[null,"Zand",null,null,null,null,"Zomer- en winterpeil (tegen natuurlijk)",null,null,null,null,null,null,null,{"$f":"IF(B8=bodemtype,\"\",Invoer!B8)","v":"Zand"},"Zand"]
[null,null,null,null,null,null,"Flexibel peil"]
[]
[]
[null,"INVOER LANDBOUW"]
[null,"Irrigatie","Vorm irrigatie","Watervolume","Kleipercentage","Organische stof","Calcium","Magnesium","Natrium"]
[null,"Ja","op het blad (bijv.: sprinklerirrigatie)","< 80 mm","< 10% (zand - lichte zavel)","< 1,5%","< 80%","< 6%","< 1,5%"]
[null,"Nee","anders (bijv.: druppel- of subirrigatie)","80 - 200 mm","10 - 30% (lichte zavel - lichte klei)","1,5 - 3,5%","80 - 90%","6 - 10%","> 1,5%"]
[null,null,null,"> 200 mm","> 30% (klei - zware klei)","> 3,5%","> 90%","> 10%"]
[]
[null,"Maanden"]
[null,"jan"]
[null,"feb"]
[null,"mrt"]
[null,"apr"]
[null,"mei"]
[null,"juni"]
[null,"juli"]
[null,"aug"]
[null,"sept"]
[null,"okt"]
[null,"nov"]
[null,"dec"]
[]
[null,"INVOER KRW"]
[null,"Doeltypen","Situatie","Min zout","Max zout","Toxiciteit","Interne eutrofiëring","EKR","Zoutsituatie"]
[null,"M01a: Gebufferde sloten op zand of klei (zwak brak)","zoet",3,3,"Ja","Ja","0,8 - 1,0","zoet (<300 mg Cl/l)",1]
[null,"M01b: Niet zoete, gebufferde sloten op zand of klei","Voorheen brak, nu zoet",3,3,"Nee","Nee","0,6 - 0,8","verzoet (was brak, nu 300 - 1.000 mg Cl/l), geen zoutpieken > 1.000 mg Cl/l",2]
[null,"M03: Gebufferde (regionale) kanalen","zoet",1,2,null,null,"0,4 - 0,6","verzoet (was brak, nu 300 - 1.000 mg Cl/l), met zoutpieken > 1.000 mg Cl/l",3]
[null,"M06: Grote ondiepe kanalen","zoet",1,2,null,null,"0,2 - 0,4","brak (1.000 - 3.000 mg Cl/l)",4]
[null,"M07: Grote diepe kanalen","zoet",1,2,null,null,"0,0 - 0,2","brak (3.000 - 10.000 mg Cl/l)",5]
[null,"M08: Gebufferde laagveensloten","zoet",1,2,null,null,null,"brak (> 10.000 mg Cl/l) ",6]
[null,"M10: laagveenvaarten en – kanalen","zoet",1,2]
[null,"M11: Kleine ondiepe gebufferde plassen","zoet",1,2]
[null,"M14: Ondiepe gebufferde plassen","zoet",1,2]
[null,"M15: Ondiepe grote gebufferde meren","zoet",1,2]
[null,"M20: Matig grote diepe gebufferde meren","zoet",1,2]
[null,"M21: Grote diepe gebufferde meren","zoet",1,2]
[null,"M22: Kleine ondiepe kalkrijke plassen","zoet",1,2]
[null,"M23: Grote ondiepe kalkrijke plassen","zoet",1,2]
[null,"M25: Ondiepe laagveenplassen","zoet",1,2]
[null,"M27: Matig grote ondiepe laagveenplassen","zoet",1,2]
[null,"M29: Matig grote diepe laagveenmeren","zoet",1,2]
[null,"M30: Zwak brakke wateren","brak",4,4]
[null,"M31 Kleine brakke tot zoute wateren","brak",5,6]
[null,"M32 Grote brakke tot zoute meren ","brak",5,6]
[null,"H3150: Meren met Krabbescheer en fonteinkruiden","zoet",1,2]
[null,"H3140: Kranswierwateren (in zoete wateren)","zoet",1,2]
[]
[]
[]
[null,"INVOER TERRESTRISCH"]
[null,"NNN typen",null,"Habitattypen",null,null,null,"Kwaliteit ","Gevoeligheid",null,"Omvangrijk"]
[null,"N01.03-Rivier- en moeraslandschap",null,"H1320 - Slijkgrasvelden",null,null,null,"Onbekend","Hoog",null,"Omvangrijk"]
[null,"N05.02-Gemaaid rietland",null,"H1330_B - Schorren en zilte graslanden (binnendijks)",null,null,null,"Slecht","Laag",null,"Niet omvangrijk"]
[null,"N05.03-Veenmoeras",null,"H2140_A - Duinheiden met kraaihei (vochtig)",null,null,null,"Matig"]
[null,"N05.04-Dynamisch Moeras",null,"H2180_B - Duinbossen (vochtig)",null,null,null,"Goed"]
[null,"N06.01-Veenmosrietland en moerasheide",null,"H2180_C - Duinbossen (binnenduinrand)"]
[null,"N06.02-Trilveen",null,"H2190_B - Vochtige duinvalleien (kalkrijk)"]
[null,"N06.04-Vochtige heide",null,"H2190_C - Vochtige duinvalleien (ontkalkt)"]
[null,"N08.01-Strand en embryonaal duin",null,"H2190_D - Vochtige duinvalleien (hoge moerasplanten)"]
[null,"N10.01-Nat schraalland",null,"H4010_B - Vochtige heiden (laagveengebied)"]
[null,"N10.02-Vochtig hooiland",null,"H6120 - Stroomdalgraslanden"]
[null,"N12.01-Bloemdijk",null,"H6230 - Heischrale graslanden"]
[null,"N12.02-Kruiden- en faunarijk grasland",null,"H6410 - Blauwgraslanden"]
[null,"N12.03-Glanshaverhooiland",null,"H6430_A - Ruigten en zomen (moerasspirea)"]
[null,"N12.04-Zilt- en overstromingsgrasland",null,"H6430_B - Ruigten en zomen (harig wilgenroosje)"]
[null,"N12.05-Kruiden- en faunarijke akker",null,"H6510_A - Glanshaver- en vossenstaarthooilanden (glanshaver)"]
[null,"N12.06-Ruigteveld",null,"H6510_B - Glanshaver- en vossenstaarthooilanden (grote vossenstaart)"]
[null,"N13.01-Vochtig weidevogelgrasland",null,"H7140_A - Overgangs- en trilvenen (trilvenen)"]
[null,"N13.02-Wintergastenweide",null,"H7140_B - Overgangs- en trilvenen (veenmosrietlanden)"]
[null,"N14.01-Rivier- en beekbegeleidend bos",null,"H7150 - Pioniervegetaties met snavelbiezen"]
[null,"N14.02-Hoog- en laagveenbos",null,"H7210 - Galigaanmoerassen"]
[null,"N14.03-Haagbeuken- en essenbos",null,"H7230 - Kalkmoerassen"]
[null,"N15.01-Duinbos",null,"H91D0 - Hoogveenbossen"]
[null,"N15.02-Dennen-, eiken-, en beukenbos",null,"H91E0_A - Vochtige alluviale bossen (zachthoutooibossen)"]
[null,"N16.04-Vochtig bos met productie",null,"H91E0_B - Vochtige alluviale bossen (essen-iepenbossen)"]
[null,"N17.03-Park- en stinzenbos",null,"H91E0_C - Vochtige alluviale bossen (beekbegeleidende bossen)"]
[null,"N17.04-Eendenkooi"]
[null,"N17.05-Wilgengriend"]
[null,"N17.06-Vochtig en hellinghakhout"]

{"sheet":"Grenswaarden landbouw","index":13,"n_rows":60,"n_cols":16,"rows_kept":60,"cut":false,"hidden":true,"merged":[]}
[]
[]
[null,"Bodemtype","Tolerantie gewas","Maximale EC irrigatiewater","Chloridegehalte",null,null,null,null,null,null,null,null,null,"chloridegehalte","EC"]
[null,"Klei","Gevoelig",2,400,null,null,null,null,null,null,null,null,null,100,0.7]
[null,"Zavel (zwaar)","Gevoelig",2.5,550,null,null,null,null,null,null,null,null,null,300,1.5]
[null,"Zavel (licht)","Gevoelig",3,750,null,null,null,null,null,null,null,null,null,400,2]
[null,"Zand","Gevoelig",3,750,null,null,null,null,null,null,null,null,null,550,2.5]
[null,"Veen","Gevoelig",2.5,550,null,"redelijk uniek i.c.m. landbouw. Groot bufferend vermogen",null,null,null,null,null,null,null,750,3]
[null,"Klei","Matig tolerant",3,750,null,"disclaimer voor veen, heel weinig kennis over",null,null,null,null,null,null,null,1100,4]
[null,"Zavel (zwaar)","Matig tolerant",5.5,1600,null,"niet zo erg als klei, maar niet zo makkelijk als zand",null,null,null,null,null,null,null,2400,7.5]
[null,"Zavel (licht)","Matig tolerant",7,2200,null,"veen ingeschaald als zware zavel, veilige kant"]
[null,"Zand","Matig tolerant",8,2600]
[null,"Veen","Matig tolerant",5.5,1600]
[null,"Klei","Tolerant",4.5,1250]
[null,"Zavel (zwaar)","Tolerant",8,2600]
[null,"Zavel (licht)","Tolerant",8.5,2800]
[null,"Zand","Tolerant",10,3400]
[null,"Veen","Tolerant",8,2600]
[]
[]
[null,"Doelgewas","Tolerantie gewas","Kieming","Zaailing","Vegatieve fase","Oogst","Acute waardevermindering bij sprinklerirrigatie?"]
[null,"Gras","matig tolerant","gevoelig","tolerant","tolerant","tolerant","laag"]
[null,"(Zomer)tarwe","matig tolerant","matig tolerant","matig tolerant","matig tolerant","tolerant","laag"]
[null,"Aardappel","matig tolerant","matig tolerant","matig tolerant","matig tolerant","matig tolerant","laag"]
[null,"(Snij)maïs","gevoelig","gevoelig","gevoelig","gevoelig","gevoelig","laag"]
[null,"Suikerbiet","tolerant","matig tolerant","tolerant","tolerant","tolerant","laag",null,null,null,null,null,null,3.8,{"$f":"165*O26^1.3438","v":992.19524490137837}]
[null,"Ui","gevoelig","gevoelig","gevoelig","gevoelig","gevoelig","laag"]
[null,"Gerst","tolerant","matig tolerant","tolerant","tolerant","tolerant","laag"]
[null,"Tulp","gevoelig","gevoelig","gevoelig","gevoelig","gevoelig","hoog"]
[null,"Peer","gevoelig","n.v.t.","n.v.t.","gevoelig","gevoelig","hoog"]
[null,"Lelie","gevoelig","gevoelig","gevoelig","gevoelig","gevoelig","hoog"]
[null,"Overige boomsoorten","gevoelig","n.v.t.","n.v.t.","gevoelig","gevoelig","hoog"]
[]
[null,"Risico zonder sprinklers"]
[null,"Doelgewas","Standaard risico gewas","Standaard risico kieming","Standaard risico zaailing","Standaard risico vegetatief","Standaard risico oogst"]
[null,"Gras",{"$f":"IF(C22=\"gevoelig\",\"hoog\",IF(C22=\"matig tolerant\",\"midden\",\"laag\"))","v":"midden"},{"$f":"IF(D22=\"gevoelig\",\"hoog\",IF(D22=\"matig tolerant\",\"midden\",\"laag\"))","v":"hoog"},{"$f":"IF(E22=\"gevoelig\",\"hoog\",IF(E22=\"matig tolerant\",\"midden\",\"laag\"))","v":"laag"},{"$f":"IF(F22=\"gevoelig\",\"hoog\",IF(F22=\"matig tolerant\",\"midden\",\"laag\"))","v":"laag"},{"$f":"IF(G22=\"gevoelig\",\"hoog\",IF(G22=\"matig tolerant\",\"midden\",\"laag\"))","v":"laag"}]
[null,"(Zomer)tarwe",{"$f":"IF(C23=\"gevoelig\",\"hoog\",IF(C23=\"matig tolerant\",\"midden\",\"laag\"))","v":"midden"},"midden","midden","midden","laag"]
[null,"Aardappel","midden","midden","midden","midden","midden"]
[null,"(Snij)maïs","hoog","hoog","hoog","hoog","hoog"]
[null,"Suikerbiet","laag","midden","laag","laag","laag"]
[null,"Ui","hoog","hoog","hoog","hoog","hoog"]
[null,"Gerst","laag","midden","laag","laag","laag"]
[null,"Tulp","hoog","hoog","hoog","hoog","hoog"]
[null,"Peer","hoog","laag","laag","hoog","hoog"]
[null,"Lelie","hoog","hoog","hoog","hoog","hoog"]
[null,"Overige boomsoorten","hoog","laag","laag","hoog","hoog"]
[]
[null,"Risico met sprinklers"]
[null,"Doelgewas","Standaard risico gewas","Standaard risico kieming","Standaard risico zaailing","Standaard risico vegetatief","Standaard risico oogst"]
[null,"Gras",{"$f":"IF(C22=\"gevoelig\",\"hoog\",IF(C36=\"matig tolerant\",\"hoog\",\"midden\"))","v":"midden"},{"$f":"IF(D22=\"gevoelig\",\"hoog\",IF(D36=\"matig tolerant\",\"hoog\",\"midden\"))","v":"hoog"},{"$f":"IF(E22=\"gevoelig\",\"hoog\",IF(E36=\"matig tolerant\",\"hoog\",\"midden\"))","v":"midden"},{"$f":"IF(F22=\"gevoelig\",\"hoog\",IF(F36=\"matig tolerant\",\"hoog\",\"midden\"))","v":"midden"},{"$f":"IF(G22=\"gevoelig\",\"hoog\",IF(G36=\"matig tolerant\",\"hoog\",\"midden\"))","v":"midden"}]
[null,"(Zomer)tarwe",{"$f":"IF(C23=\"gevoelig\",\"hoog\",IF(C37=\"matig tolerant\",\"hoog\",\"midden\"))","v":"midden"},"midden","midden","midden","midden"]
[null,"Aardappel","midden","midden","midden","midden","midden"]
[null,"(Snij)maïs","hoog","hoog","hoog","hoog","hoog"]
[null,"Suikerbiet","midden","midden","midden","midden","midden"]
[null,"Ui","hoog","hoog","hoog","hoog","hoog"]
[null,"Gerst","midden","midden","midden","midden","midden"]
[null,"Tulp","hoog","hoog","hoog","hoog","hoog"]
[null,"Peer","hoog","midden","midden","hoog","hoog"]
[null,"Lelie","hoog","hoog","hoog","hoog","hoog"]
[null,"Overige boomsoorten","hoog","midden","midden","hoog","hoog"]

{"sheet":"Grenswaarden Terrestrisch","index":14,"n_rows":62,"n_cols":6,"rows_kept":62,"cut":false,"hidden":true,"merged":[]}
[]
[]
["Natuurdoel (NNN beheertypen)","kritische grens verzoeting","kritische grens verzilting","kritische grens voor dit afwegingskader","Toelichting","Zouttolerantie"]
[null,"(mg Cl/l)","(mg Cl/l)"]
["N01.03-Rivier- en moeraslandschap","n.v.t.",300,300," brede standplaats","tolerant"]
["N05.02-Gemaaid rietland","n.v.t.",300,300,null,"tolerant"]
["N05.03-Veenmoeras","n.v.t.",300,300,null,"tolerant"]
["N05.04-Dynamisch Moeras","n.v.t.",300,300,null,"tolerant"]
["N12.02-Kruiden- en faunarijk grasland","n.v.t.",300,300,null,"tolerant"]
["N12.04-Zilt- en overstromingsgrasland","n.v.t. (1000/3000)","n.v.t.","n.v.t.","-    grens 1.000: 26AB02, 26AB04, 26AC01B, 26RG04","tolerant"]
[null,null,null,null,"-    grens 3.000: 25AA02, 26AA01B, 26AA01, 26AB01B, 26AB03, 26AC02, 26RG02, 26RG03 ","tolerant"]
["N12.06-Ruigteveld","n.v.t.",300,300,null,"tolerant"]
["N13.01-Vochtig weidevogelgrasland","n.v.t.","300 (3.000)",300,"-    grens 3.000: 12BA02","tolerant"]
["N13.02-Wintergastenweide","n.v.t.","300 (3.000)",300,"-    grens 3.000: 12BA02","tolerant"]
["N14.01-Rivier- en beekbegeleidend bos","n.v.t.",300,300,null,"tolerant"]
["N17.04-Eendenkooi","n.v.t.",300,300,null,"tolerant"]
["N17.05-Wilgengriend","n.v.t.",300,300,null,"tolerant"]
["N17.06-Vochtig en hellinghakhout","n.v.t.",300,300,null,"tolerant"]
["N10.02-Vochtig hooiland","n.v.t.","300 (1.000/3.000)",300,"-    grens 1.000: 08BC01, 08RG07","matig tolerant"]
[null,null,null,null,"-    grens 3.000: 12BA03A, 12BA03B ","matig tolerant"]
["N12.01-Bloemdijk","n.v.t.","150 (300)",150,"-    grens 300: 16BC01A, 17AA01B","matig tolerant"]
["N12.03-Glanshaverhooiland","n.v.t.","150 (300)",150,"-    grens 300: 16BA02","matig tolerant"]
["N12.05-Kruiden- en faunarijke akker","n.v.t.",300,300,null,"matig tolerant"]
["N14.02-Hoog- en laagveenbos","n.v.t.",150,150,null,"matig tolerant"]
["N14.03-Haagbeuken- en essenbos","n.v.t.",150,150,null,"matig tolerant"]
["N15.01-Duinbos","n.v.t.","150 (300)",150,"-    grens 300: 37AC01, 37AC02B","matig tolerant"]
["N15.02-Dennen-, eiken-, en beukenbos","n.v.t.",150,150,null,"matig tolerant"]
["N16.04-Vochtig bos met productie","n.v.t.",300,300,null,"matig tolerant"]
["N17.03-Park- en stinzenbos","n.v.t.",300,300,null,"matig tolerant"]
["N06.01-Veenmosrietland en moerasheide","n.v.t.","150 (1.000)",150,"-    grens 1.000: 09AA02, 09AA02B, 11BA02B","gevoelig"]
["N06.02-Trilveen","n.v.t.",150,150,null,"gevoelig"]
["N06.04-Vochtige heide","n.v.t.",150,150,null,"gevoelig"]
["N10.01-Nat schraalland","n.v.t.","150 (300/1.000)",150,"-    grens 300: 07AA03, 08C02A, 08C03, 08RG07, 09BA05, 16AB04, 28AA01","gevoelig"]
[null,null,null,null,"-    grens 1.000: 06AC04, 08AA04"]
[]
["Natuurdoel (Natura 2000 habitattypen)","kritische grens verzoeting ","kritische grens verzilting ","kritische grens voor dit afwegingskader","Toelichting","Zouttolerantie"]
[null,"(mg Cl/l)","(mg Cl/l)"]
["H1320 - Slijkgrasvelden"," 3.000","n.v.t.","n.v.t.",null,"tolerant"]
["H1330_B - Schorren en zilte graslanden (binnendijks)"," 1.000","n.v.t.","n.v.t.",null,"tolerant"]
["H6430_B - Ruigten en zomen (harig wilgenroosje)","n.v.t."," 10.000",10000,null,"tolerant"]
["H6510_B - Glanshaver- en vossenstaarthooilanden (grote vossenstaart)","n.v.t.",300,300,null,"tolerant"]
["H2140_A - Duinheiden met kraaihei (vochtig)","n.v.t.","150 (300) ",150,"-    grens 300: 20AB04","matig tolerant"]
["H2180_B - Duinbossen (vochtig)","n.v.t.","150 ",150,null,"matig tolerant"]
["H2180_C - Duinbossen (binnenduinrand)","n.v.t.","150 ",150,null,"matig tolerant"]
["H2190_D - Vochtige duinvalleien (hoge moerasplanten)","n.v.t.","3.000 ",3000,null,"matig tolerant"]
["H6430_A - Ruigten en zomen (moerasspirea)","n.v.t.","150 ",150,null,"matig tolerant"]
["H6510_A - Glanshaver- en vossenstaarthooilanden (glanshaver)","n.v.t.","150 ",150,null,"matig tolerant"]
["H91E0_A - Vochtige alluviale bossen (zachthoutooibossen)","n.v.t.",300,300,null,"matig tolerant"]
["H91E0_B - Vochtige alluviale bossen (essen-iepenbossen)","n.v.t.",150,150,null,"matig tolerant"]
["H91E0_C - Vochtige alluviale bossen (beekbegeleidende bossen)","n.v.t."," 150",150,null,"matig tolerant"]
["H2190_B - Vochtige duinvalleien (kalkrijk)","n.v.t."," 3000",3000,null,"gevoelig"]
["H2190_C - Vochtige duinvalleien (ontkalkt)","n.v.t."," 300",300,null,"gevoelig"]
["H4010_B - Vochtige heiden (laagveengebied)","n.v.t."," 150 (3.000?)",150,"-    grens 3.000: 11BA02B","gevoelig"]
["H6120 - Stroomdalgraslanden","n.v.t.","150 ",150,null,"gevoelig"]
["H6230 - Heischrale graslanden","n.v.t."," 150",150,null,"gevoelig"]
["H6410 - Blauwgraslanden","n.v.t."," 150",150,null,"gevoelig"]
["H7140_A - Overgangs- en trilvenen (trilvenen)","n.v.t."," 150",150,null,"gevoelig"]
["H7140_B - Overgangs- en trilvenen (veenmosrietlanden)","n.v.t."," 150 (1.000)",150,"-    grens 1.000: 09AA02B","gevoelig"]
["H7150 - Pioniervegetaties met snavelbiezen","n.v.t."," 150",150,null,"gevoelig"]
["H7210 - Galigaanmoerassen","n.v.t."," 300",300,null,"gevoelig"]
["H7230 - Kalkmoerassen","n.v.t."," 150 (300)",150,"-    grens 300: 09BA05, SBB-09C2","gevoelig"]
["H91D0 - Hoogveenbossen","n.v.t."," 150",150,null,"gevoelig"]